{"text_format":"1","workbook":"xlsx","n_sheets":30,"sheets":["Disclaimer","Switchboard","Summary Stats","Purchases","Inventory","Shopping List","Countries","Special Designations","Vintages","Varietals","Wine Colors","Closures","Custom 1","Custom 2","Vendors","Rating Scores","Score vs Price","Wines by Price","Bottles On-Hand","Btls Avl by Yr","Btls Avl by Yr by Color","Inv Composition","Cellar History, Pt 1","Cellar History, Pt 2","Cellar History, Pt 3","Cellar History, Inv Comp","Cellar History, Countries","Cellar History, Spc Dsgns","Data Items","Fully Consumed"],"not_rendered":{"charts":44,"images":0,"macros":1,"external_links":0,"defined_names":90,"comments":1,"pivot_tables":0},"unopened":[{"sheet":"Countries","index":6,"reason":"not_a_worksheet"},{"sheet":"Special Designations","index":7,"reason":"not_a_worksheet"},{"sheet":"Vintages","index":8,"reason":"not_a_worksheet"},{"sheet":"Varietals","index":9,"reason":"not_a_worksheet"},{"sheet":"Wine Colors","index":10,"reason":"not_a_worksheet"},{"sheet":"Closures","index":11,"reason":"not_a_worksheet"},{"sheet":"Custom 1","index":12,"reason":"not_a_worksheet"},{"sheet":"Custom 2","index":13,"reason":"not_a_worksheet"},{"sheet":"Vendors","index":14,"reason":"not_a_worksheet"},{"sheet":"Rating Scores","index":15,"reason":"not_a_worksheet"},{"sheet":"Score vs Price","index":16,"reason":"not_a_worksheet"},{"sheet":"Wines by Price","index":17,"reason":"not_a_worksheet"},{"sheet":"Bottles On-Hand","index":18,"reason":"not_a_worksheet"},{"sheet":"Btls Avl by Yr","index":19,"reason":"not_a_worksheet"},{"sheet":"Btls Avl by Yr by Color","index":20,"reason":"not_a_worksheet"},{"sheet":"Inv Composition","index":21,"reason":"not_a_worksheet"},{"sheet":"Cellar History, Pt 1","index":22,"reason":"not_a_worksheet"},{"sheet":"Cellar History, Pt 2","index":23,"reason":"not_a_worksheet"},{"sheet":"Cellar History, Pt 3","index":24,"reason":"not_a_worksheet"},{"sheet":"Cellar History, Inv Comp","index":25,"reason":"not_a_worksheet"},{"sheet":"Cellar History, Countries","index":26,"reason":"not_a_worksheet"},{"sheet":"Cellar History, Spc Dsgns","index":27,"reason":"not_a_worksheet"}],"bounds":{"document_bytes":16777216,"sheet_cells":100000,"rows_first":2000,"rows_last":500,"rows_between":2000,"halvings":0,"cell_chars":16384,"cell_head_chars":4096},"cells_cut":0,"cells_raw":0,"read":"whole","date_system":"1900"}

{"sheet":"Disclaimer","index":0,"n_rows":98,"n_cols":1,"rows_kept":98,"cut":false,"hidden":false,"merged":[]}
["CHR TOOLS EVALUATION LICENSE"]
[]
["IMPORTANT --- READ CAREFULLY. This evaluation license agreement (\"Agreement\") is a legal contract between you (either an individual or a single business entity) and The Center for Hospitality Research at Cornell University (\"Licensor\") for the software product identified above, which includes computer software and, as applicable, associated media, printed materials, and \"online\" or electronic documentation (the \"Software Application\")."]
[]
["BY INSTALLING, COPYING, OR OTHERWISE USING THE SOFTWARE APPLICATION, YOU AGREE TO BE BOUND BY THE TERMS OF THIS AGREEMENT. IF YOU DO NOT AGREE TO THE TERMS OF THIS AGREEMENT, DO NOT INSTALL OR USE THE SOFTWARE APPLICATION."]
[]
["License Terms"]
[]
["Following acceptance of this Agreement and on-line registration with the Licensor, you may use, strictly for trial use and evaluation purposes only, one copy of the Software Application."]
[]
["You may not reverse engineer, decompile, disassemble, or otherwise translate the Software Application, except and only to the extent that such activity is expressly permitted by applicable law notwithstanding this limitation."]
[]
["The Software Application and related user documentation if any are proprietary products of Licensor protected under U.S. copyright law. All right, title, and interest in and to the Software Application, including associated intellectual property rights, are and shall remain with Licensor. This Agreement does not convey to you an interest in or to the Software Application, but only a limited right of use revocable in accordance with the terms of this Agreement."]
[]
["The Software Application is provided without charge under this evaluation license. The free trial period is of limited duration. Licensor may extend the free trial period, but reserves the right, at any time, to condition access on the payment of charges. Licensor may terminate access to the tool upon 30 days' prior notice."]
[]
["Licensor will not provide you with support services related to the Software Application, and is under no obligation to do so."]
[]
["You may not distribute copies of the Software Application to third parties or transfer any rights under this Agreement."]
[]
["Without prejudice to any other rights, Licensor may terminate this Agreement if you fail to comply with the terms and conditions of this Agreement. In such event, you must destroy all copies of the Software Application and all of its component parts."]
[]
["Governing Law"]
[]
["This Agreement shall be governed by the laws of the State of New York."]
[]
["Proprietary Rights"]
[]
["Copyright. All title and copyrights in and to the Software Application (including, without limitation, any images, photographs, animations, video, audio, music, text, and \"applets\" incorporated into the Software Application), the accompanying media and printed materials, and any copies of the Software Product are owned by Licensor or its suppliers. The Software Application is protected by copyrights laws and international treaty provisions. Therefore, you must treat the software Application like any other copyrighted material, subject to the provisions of this Agreement."]
[]
["U.S. Government Restricted Rights. The Software Application and documentation are provided with RESTRICTED RIGHTS. Use, duplication, or disclosure by the Government is subject to restrictions as set forth in subparagraph (c)(1)(ii) of the Rights in technical Data and Computer Software clause at DFARS 252.227-7013 or subparagraphs (c) (1) and (2) of the Commercial Computer Software -- Restricted Rights at 48 CFR 52.227-19, as applicable. Manufacturer for such purpose is The Center for Hospitality Research, with offices in the School of Hotel Administration at Cornell University, Ithaca, NY 14853."]
[]
["Submissions. Should you decide to transmit to Licensor's website by any means or by any media any materials or other information (including, without limitation, ideas, concepts or techniques for new or improved services and products), whether as information, feedback, data, questions, comments, suggestions or the like, you agree such submissions are unrestricted and shall be deemed non-confidential and you automatically grant Licensor and its assigns a non-exclusive, royalty-free, worldwide, perpetual, irrevocable license, with the right to sublicense, to use, copy, transmit, distribute, create derivative works of, display and perform the same."]
[]
["Disclaimer Of Warranty"]
[]
["THIS SOFTWARE AND THE ACCOMPANYING FILES ARE PROVIDED \"AS IS\". LICENSOR AND ITS SUPPLIERS DO NOT AND CANNOT WARRANT THE PERFORMANCE OR RESULTS YOU MAY OBTAIN BY USING THE SOFTWARE OR SUCH FILES. LICENSOR AND ITS SUPPLIERS MAKE NO WARRANTIES, EXPRESS OR IMPLIED, AS TO TITLE OR INFRINGEMENT OF THIRD-PARTY RIGHTS, MERCHANTABILITY OR FITNESS FOR ANY PARTICULAR PURPOSE."]
[]
["Good data processing procedure dictates that any program be thoroughly tested with non-critical data before relying on it. the user must assume the entire risk of using the Software Application. ANY LIABILITY OF LICENSOR FOR A DEFECTIVE COPY OF THE SOFTWARE APPLICATION WILL BE LIMITED EXCLUSIVELY TO REPLACEMENT OF YOUR COPY OF THE SOFTWARE APPLICATION WITH ANOTHER COPY OR REFUND OF THE INITIAL LICENSE FEE LICENSOR RECEIVED FROM YOU FOR THE DEFECTIVE COPY OF THE PRODUCT (IF ANY). IN NO EVENT WILL LICENSOR OR ITS SUPPLIERS BE LIABLE TO YOU FOR ANY CONSEQUENTIAL, INCIDENTAL OR SPECIAL DAMAGES, INCLUDING ANY LOST PROFITS OR LOST SAVINGS, EVEN IF A LICENSOR REPRESENTATIVE HAS BEEN ADVISED OF THE POSSIBILITY OF SUCH DAMAGES, OR FOR ANY CLAIM BY ANY THIRD PARTY."]
[]
["Some states or jurisdictions do not allow the exclusion or limitation of incidental, consequential or special damages, or the exclusion of implied warranties or limitations on how long a given warranty may last, so the above limitations may not apply to you."]
[]
["CHR TOOLS END-USER LICENSE"]
[]
["LICENSOR'S PROGRAM IS COPYRIGHTED AND LICENSED (NOT SOLD). LICENSOR DOES NOT SELL OR TRANSFER TITLE TO THE LICENSED PROGRAM TO YOU. YOUR LICENSE OF THE LICENSED PROGRAM WILL NOT COMMENCE UNTIL YOU HAVE REGISTERED WITH LICENSOR, PAID THE LICENSE FEE AND HAVE RECEIVED AN ACTIVATION CODE."]
[]
["IMPORTANT --- READ CAREFULLY. This evaluation license agreement (\"Agreement\") is a legal contract between you (either an individual or a single business entity) and The Center for Hospitality Research at Cornell University (\"Licensor\") for the software product identified above, which includes computer software and, as applicable, associated media, printed materials, and \"online\" or electronic documentation (the \"Software Application\")."]
[]
["BY INSTALLING, COPYING, OR OTHERWISE USING THE SOFTWARE APPLICATION, YOU AGREE TO BE BOUND BY THE TERMS OF THIS AGREEMENT. IF YOU DO NOT AGREE TO THE TERMS OF THIS AGREEMENT, DO NOT INSTALL OR USE THE SOFTWARE APPLICATION. "]
[]
["1. License. In exchange for payment of the license fee, Licensor grants you a nonexclusive license to use the package of computer programs and data in machine-readable form and related materials, including documentation and listings which together constitute the \"Licensed Program\", subject to the following terms and conditions."]
[]
["2. Scope of Rights. You may:"]
["-- Install and execute the Licensed Program on the computer specified in the license registration process, to serve the internal needs of your business;"]
["-- In support of your authorized use of the Licensed Program, store the Licensed Program's machine-readable instructions or data in, transmit it through, and display it on machines associated with the specified computer."]
[]
["3. Support. Licensor shall support the Licensed Program without additional charge, by e-mail and by free upgrades of the Licensed Program as they may be issued, for a period of one year following the beginning of the license term. Licensor is not obligated to issue any upgrades of the Licensed Program."]
[]
["4. Your Responsibilities:"]
[]
["You are responsible for selecting an operator who is qualified to operate the Licensed Program on your own equipment and who is familiar with the information, calculations, and reports that serve as input and output of the Licensed Program; -- You are solely responsible for payment of any taxes (including sales or use taxes, intangible taxes, and property taxes) resulting from your acceptance of this license and your possession and use of the Licensed Program, exclusive of taxes based on Licensor's income. Licensor reserves the right to have you pay any such taxes as they fall due to Licensor for remittance to the appropriate authority. You agree to hold harmless Licensor from all claims and liability arising from your failure to report or pay such taxes;"]
["You are solely responsible for converting your data files for use with the Licensed Program, and Licensor assumes no responsibility for such conversion;"]
["You are responsible for reasonable backup precautions; Licensor shall have no liability for loss of data or documentation."]
[]
["5. Proprietary Protection and Ownership. Licensor is and shall remain the sole and exclusive owner of all right, title and interest in and to the Licensed Program and all modifications and enhancements thereof (including ownership of all trade secrets and copyrights pertaining thereto), subject only to the rights and privileges expressly granted to you herein by Licensor. This Agreement does not provide you with title or ownership of the Licensed Program, but only a right of limited use."]
[]
["6. Restrictions on Use of the Licensed Program. You may not:"]
[]
["Use, copy, modify, or distribute the Licensed Program (electronically or otherwise), or any copy, adaptation, transcription, or merged portion thereof, except as expressly authorized by Licensor;"]
["Reverse assemble, reverse compile, or otherwise translate the Licensed Program;"]
["Transfer, lease, assign, or sublicense the Licensed Program except for a transfer of the Licensed Program in its entirety to (1) a successor in interest of your entire business who assumes the obligations of this Agreement or (2) any other party who is reasonably acceptable to Licensor and who enters into a substitute version of this Agreement, and pays an administrative fee intended to cover attendants costs;"]
["Use the Licensed Program for service bureau work, multiple-user license, or time-sharing arrangement;"]
["Install the Licensed Program in any other computer system or use it at any other location without first de-activating the Licensed Program on the computer from which the Licensed Program is to be transferred as provided by the operating instructions."]
[]
["7. Infringement. If a third party claims that the Licensed Program infringes its patent, copyright, or trade secret, or any similar intellectual property right, Licensor will defend you against that claim at Licensor's expense and pay all damages that a court finally awards, provided that you promptly notify Licensor in writing of the claim, and allow Licensor to control, and cooperate with Licensor in, the defense or any related settlement negotiations. If such a claim is made or appears possible, you agree to permit Licensor to enable you to continue to use the Licensed Programs, or to modify or replace them. If Licensor determines that none of these alternatives is reasonably available, you agree to return the Licensed Program on Licensor's written request, and you will then receive a credit equal to your net book value for the Licensed Program determined in accordance with generally accepted accounting principles. However, Licensor has no obligation for any claim based on your modification of the Licensed Program or its combination, operation, or use with any product, data, or apparatus not specified or provided by Licensor, provided that such claim solely and necessarily is based on such combination, operation, or use and such claim would be avoided by combination, operation, or use with products, data, or apparatus specified or provided by Licensor. THIS PARAGRAPH STATES LICENSOR'S ENTIRE OBLIGATION TO YOU WITH RESPECT TO ANY CLAIM OF INFRINGEMENT."]
[]
["8. Limited Warranty and Limitation of Liability. Licensor warrants, for your benefit alone, that the Licensed Program conforms in all material respects to the specifications for the current version of the Licensed Program."]
[]
["EXCEPT AS EXPRESSLY SET FORTH IN THIS AGREEMENT, LICENSOR DISCLAIMS ANY AND ALL PROMISES, REPRESENTATIONS, AND WARRANTIES WITH RESPECT TO THE LICENSED PROGRAM, INCLUDING ITS CONDITION, ITS CONFORMITY TO ANY REPRESENTATION OR DESCRIPTION, THE EXISTENCE OF ANY LATENT OR PATENT DEFECTS, ANY NEGLIGENCE, AND ITS MERCHANTABILITY OR FITNESS FOR A PARTICULAR USE."]
[]
["The cumulative liability of Licensor to you for all claims relating to the Licensed Program and this Agreement, including any cause of action sounding in contract, tort, or strict liability, shall not exceed the total amount of all license fees paid to Licensor hereunder. This limitation of liability is intended to apply without regard to whether other provisions of this Agreement have been breached or have proven ineffective. This limitation of liability shall not apply to the indemnification provided in Section 7 hereof. In no event shall Licensor be liable for any loss of profits; any incidental, special, exemplary, or consequential damages; or any claims or demands brought against you even if Licensor has been advised of the possibility of such claims or demands. This limitation upon damages and claims is intended to apply without regard to whether other provisions of this Agreement have been breached or have proven ineffective."]
[]
["You may have additional rights under certain laws (e.g., consumer laws) that do not allow the exclusion of implied warranties, or the exclusion or limitation of certain damages. If such laws apply, our exclusions or limitations do not apply to you."]
[]
["9. Submissions. Should you decide to transmit to Licensor's website by any means or by any media any materials or other information (including, without limitation, ideas, concepts or techniques for new or improved services and products), whether as information, feedback, data, questions, comments, suggestions or the like, you agree such submissions are unrestricted and shall be deemed non-confidential and you automatically grant Licensor and its assigns a non-exclusive, royalty-free, worldwide, perpetual, irrevocable license, with the right to sublicense, to use, copy, transmit, distribute, create derivative works of, display and perform the same."]
[]
["10. Term of Agreement; Termination. Your license of the Licensed Program shall become effective upon delivery of the Licensed Program to you and your payment of the license fee therefore, and shall continue in perpetuity unless terminated as provided herein."]
[]
["Upon termination of this Agreement, all rights granted to you will terminate and revert to Licensor. Promptly upon termination of this Agreement for any reason or upon discontinuance or abandonment of your possession or use of the Licensed Program, you must return or destroy, as requested by Licensor, all copies of the Licensed Program in your possession (whether modified or unmodified), and all other materials pertaining to the Licensed Program (including all copies thereof). You agree to certify your compliance with such restriction upon Licensor's request."]
[]
["11. Miscellaneous."]
[]
["This Agreement shall be governed by and construed in accordance with the laws of the State of New York."]
["No modification of this Agreement shall be binding unless it is in writing and is signed by an authorized representative of the party against whom enforcement of the modification is sought."]
["References to your use or benefit include any subsidiaries you may own directly or indirectly by more than fifth percent (50%), provided that, to the extent of their use and benefit, they comply with the restrictions herein."]
["Any notices required or permitted under this Agreement shall be in writing and delivered in person or sent by registered or certified mail, return receipt requested, with proper postage affixed."]
["In the event that any of the terms of this Agreement is or becomes or is declared to be invalid or void by any court or tribunal of competent jurisdiction, such term or terms shall be null and void and shall be deemed severed from this Agreement and all the remaining terms of this Agreement shall remain in full force and effect."]
["THIS AGREEMENT IS THE COMPLETE AND EXCLUSIVE STATEMENT OF LICENSOR'S OBLIGATIONS AND RESPONSIBILITIES TO YOU AND SUPERSEDES ANY OTHER PROPOSAL, REPRESENTATION OR OTHER COMMUNICATION BY OR ON BEHALF OF LICENSOR RELATING TO THE SUBJECT MATTER HEREOF."]

{"sheet":"Switchboard","index":1,"n_rows":136,"n_cols":29,"rows_kept":136,"cut":false,"hidden":false,"merged":[[0,0,0,2],[2,0,2,2],[4,0,4,2],[3,0,3,2],[8,2,10,2],[1,0,1,2],[95,0,95,2],[45,0,45,2],[37,2,38,2],[11,2,14,2],[15,2,19,2],[20,2,22,2],[23,2,26,2]]}
["Wine Cellar Management Tool",null,null,null,null,null,null,null,null,null,null,null,null,null,null,null,null,null,null,null,null,null,null,null,null,null,null,null,"Ordered"]
["[Version 3.0.0.  16 September 2015]",null,null,null,null,null,null,null,null,null,null,null,null,null,null,null,null,null,null,null,null,null,null,null,null,null,null,null,"Purchased in Person"]
["developed by Gary M. Thompson, Ph.D."]
["for distribution by the "]
["Center for Hospitality Research at Cornell University"]
[]
[]
["Wine Management Actions",null,"Instructions"]
[null,null,"For detailed instructions on the use of this spreadsheet, please see the CHR Report entitled \"Managing a Wine Cellar using a Spreadsheet\", by Gary M. Thompson.  The report is available free of charge, from the Center for Hospitality Research, at www.chr.cornell.edu.",null,null,"̌̌"]
[]
[]
[null,null,"This spreadsheet is available in two versions.  The \"Sample\" version allows you to examine how the spreadsheet will look after you have entered data on the wines you own.  The \"Blank\" version is the version you should use to enter your own data.  When you start using the \"Blank\" spreadsheet, don't worry that the charts don't look right.  Once you start entering data on your wines, the charts will update automatically."]
[]
[]
[]
[null,null,"This is the main navigation screen in the spreadsheet.  All you really need to do to start using the spreadsheet is to (1) enter a data in the \"Initial Cellar Tracking Date\" in the yellow-colored cell to the left; (2) specify whether you typically order your wines or purchase them in person; and (3) start entering information about your wine purchases.  The buttons at left allow you access to the major functions in the spreadsheet.  Please note that for these buttons to work, you will need to \"Enable Macros\" when you open the spreadsheet."]
[]
["Data Maintenance Actions"]
[]
[]
[null,null,"The light-blue-colored tabs contain information on the cellar, in table format.  The data in the 'Purchases' sheet and the 'Inventory' sheet can be sorted a variety of ways, using the buttons on those sheets.  The yellow-colored tabs are charts.  The dark-blue-colored tabs contain data used in generating the charts."]
[]
[]
[null,null,"IMPORTANT.  If you are upgrading from an earlier version of the tool, it is easy to migrate your data.  First, make sure only this file and the old version are open and no other Excel files are open.  Second, click the \"Import Data\" button to the left.  Answer \"Yes\" to the question about importing from an existing file.  Third, answer \"Yes\" to the question about clearing old data.  That's it!  The import will take some time, depending on how many wines you have, but you'll be able to see the status of the import in Excel's status bar."]
[]
[]
[]
["Most Wines are…",null,"Questions, comments or suggestions?  Email Prof. Thompson at gmt1@cornell.edu."]
[1]
[null,null,"Spreadsheet Restrictions"]
["Initial Cellar Tracking Date",null,"Limited to 1,000 different types of wine on-hand."]
["2007-01-24",null,"Limited to 2,000 purchases of wine, with existing inventory."]
["Custom Categorization 1",null,"Limited to 2,000 purchases of wine, which have been fully consumed."]
[null,null,"Limited to 24 tasting notes for each wine purchased."]
["Custom Categorization 2"]
[null,null,"Version History"]
["Custom Data Item 1",null,"1.0.0. 16 May 2009.  Initial release."]
[null,null,"1.0.1. 05 Jan 2010.  Fixed bugs with: year rollover; expired wine dates, cellar composition, 'other' vendor purchase counts"]
["Custom Data Item 2"]
[null,null,"2.0.0. 01 Aug 2010.  Numerous new features and several bug fixes (see below for details)."]
[null,null,"2.0.1. 14 Oct 2013.  Fixed an error generated by the View Wine Analysis feature."]
[null,null,"2.0.2. 15 Oct 2013.  Fixed an error in the update cellar history module."]
[null,null,"2.0.3. 8 Nov 2014.  Fixed an error in displaying watch list wines with invalid drink windows."]
[null,null,"3.0.0. 16 Sep 2015.  Numerous new features and several bug fixes (see below for details)."]
[]
["Version 2 Changes"]
["New Features",1,"New data field: location in cellar (bin, off-site, etc)"]
[null,2,"New data field: corked count"]
[null,3,"New data field: closure (natural cork, synthetic cork, screwtop,....]"]
[null,4,"New data field: current value"]
[null,5,"New data field: multiple ratings for each wine (up to 3)"]
[null,6,"New data field: color [red/rose,white,sparkling,etc]"]
[null,7,"New data field: region"]
[null,8,"New data field: exact origin"]
[null,9,"New data field: custom category 1 [e.g., maturation time in barriques]"]
[null,10,"New data field: custom category 2 [e.g., harvest time--late harvest, eiswein, auslese, etc] "]
[null,11,"New data field: custom data 1"]
[null,12,"New data field: custom data 2"]
[null,13,"New sorting: by price on the Inventory sheet"]
[null,14,"New sorting: by score on the Inventory sheet"]
[null,15,"New sorting: by vintage on the Inventory sheet"]
[null,16,"New sorting: by varietal on the Inventory sheet"]
[null,17,"New sorting: by vintage on the Purchases sheet"]
[null,18,"New sorting: by varietal on the Purchases sheet"]
[null,19,"New sorting: by filter by price [everyday, reward day, special] on the Wine Analysis form"]
[null,20,"New sorting: by list all wines by specific varietals on the Wine Analysis form"]
[null,21,"New sorting: by color on the Wine Analysis form"]
[null,22,"New sorting: by price on the Wine Analysis form"]
[null,23,"New chart: wine color"]
[null,24,"New chart: closure"]
[null,25,"New chart: custom category 1"]
[null,26,"New chart: custom category 2"]
[null,27,"New tracking over time: consumption rate by month"]
[null,28,"New tracking over time: average score"]
[null,29,"New tracking over time: cellar value"]
[null,30,"Random wine recommendation (based on drink-now scores)"]
[null,31,"Wine score reported can be based on the highest, average or priority order"]
[null,32,"Corked wines now tracked in the Wine Analysis form"]
[null,33,"Other currency options (instead of just $)"]
[null,34,"Wine analysis form now reports the # of bottles of wine in the everyday/reward/special occasion categories"]
[null,35,"Wine analysis form now reports estimated expiry dates for wine in the everyday/reward/special occasion categories"]
[null,36,"Shopping list of wines (new form and data sheet)"]
[null,37,"Uses 3-month average consumption rate for expiry-date predictions"]
["Bug Fixes",1,"Not being able to change country of wine"]
[null,2,"Drink-through changes not populating"]
[null,3,"Color-coding the wrong cell when wine added with zero inventory"]
[null,4,"Not updating wine when vendor changed"]
[null,5,"Not updating wine when price changed"]
[null,6,"Retaining the color-coding of cellar date, when a wine was modified, even though already cellared"]
[null,7,"Color-coding of drink-through and drink-from cells not correct when values change"]
[null,8,"Year rollover: not removing outdated color-coding in the \"drink from\" column of the \"inventory\" form"]
[null,9,"Year rollover: not removing color coding/add color coding on Inventory sheet for drink-from in future"]
[null,10,"Calculating negative drink-now scores (if the drink-from year had passed)"]
[]
[]
["Version 3 Changes"]
["New Features",1,"New chart: bottles available by year, by wine color."]
[null,2,"New history chart: cellar composition by country."]
[null,3,"New history chart: special designations."]
[null,4,"New history chart: inventory composition (short/med/long hold)"]
[null,5,"New history chart component: number of different wines in the cellar."]
[null,6,"Wines can now have two special designations."]
[null,7,"New data field for wine purchases: shipping method."]
[null,8,"Corked wines can now be analyzed by Closure, Shipping Method, Varietal, Vendor, Vintage & Winery."]
[null,9,"Can now sort inventory by country."]
[null,10,"Can now flag a wine as \"long hold\", which is useful for printing inventory reports."]
[null,11,"Can now show all wines, only long-hold, or only non-hold wines on the inventory sheet."]
[null,12,"Can now sort the inventory by cellar location."]
[null,13,"Can now use the tab key to move the next field in the Add Wine and Wine Maintenance forms."]
[null,14,"Reorganized the layout of the Inventory worksheet, with functions now accessible via radio buttons."]
[null,15,"The forms now appear on the same screen as the spreadsheet itself."]
[null,16,"There is a new Edit option on the Data Maintenance form."]
[null,17,"Double-clicking a Special Designation, Rating Source, Region, or Exact Origin on the Data Maintenance form now displays matching wines."]
[null,18,"The cellared date must now fall on or after the purchase date."]
[null,19,"Wines approaching the end of or past their drink windows are now color coded on the inventory sheet."]
[null,20,"When importing data from earlier versions of the spreadsheet, you are now given the option of correcting date discrepancies."]
[null,21,"Changed the size of the line and markers on the Cellar History, Pt 3 worksheet."]
[null,22,"Changed the size of the lines and markers on the Cellar History, Pt 2 worksheet."]
[null,23,"Changed the size of the markers on the Cellar History, Pt 1 worksheet."]
[null,24,"Changed the orientation of the x-axis labels on the Special Designations chart."]
[null,25,"Reoriented the x-axis labels on the Varietal chart."]
[null,26,"The default response on changing a rater for a wine is No (i.e., the change only applies to the current wine)."]
[null,27,"Changing a rater for a wine now asks again if the answer is Yes (i.e., the change applies to all wines)."]
[null,28,"You can specify the number of wines to print (between 20-75) using the \"Print One Page\" button."]
["Bug Fixes",1,"Fixed a file directory issue when importing data from an earlier version of the tool."]
[null,2,"Fixed a problem of duplicate exact origins being created."]
[null,3,"Fixed a problem with Importing data from versions 2.0.1 or 2.0.2."]
[null,4,"Changing a rating score of a wine now propagates appropriately"]
[null,5,"\"Pick a wine for me\" now does not pick the same wine twice in a row."]
[null,6,"Changing a winery name didn't save the changes correctly."]
[null,7,"Fixed a problem with importing data from an earlier version not correctly displaying the bottles available by year chart."]
[null,8,"Wines that have been fully consumed are now removed from the inventory list."]
[null,9,"Fixed a problem of hidden rows in the Inventory sheet."]
[null,10,"Fixed a problem with the calculation of the 3-month average bottles per week."]
[null,11,"Improved the labels for some unclear spreadsheet cells."]
[null,12,"Fixed a problem of updating the spreadsheet at the end of a month that was followed by a month with fewer days."]

{"sheet":"Summary Stats","index":2,"n_rows":29,"n_cols":13,"rows_kept":29,"cut":false,"hidden":false,"merged":[[0,0,0,1],[11,0,11,1],[27,0,27,1]]}
["Purchased Wines",null,null,"Rating Score","# Bottles","%",null,"Price Per Bottle","# Wines",null,"Bottles On-Hand","# Wines"]
["Actual Bottles …",null,null,"> 94",{"$f":"F2*'Data Items'!$AK$43","v":207},{"$f":"SUM('Data Items'!I3:I8)","v":0.35264054514480409},null,"< $10",{"$f":"COUNTIF(Inventory!$L$2:$L$1001,M3)","v":2},null,1,{"$f":"COUNTIF(Inventory!$H$2:$H$1001,K2)","v":12}]
["Average $/Bottle",{"$f":"(SUMPRODUCT(Purchases!G3:G2002,Purchases!K3:K2002,Purchases!O3:O2002)+SUMPRODUCT('Fully Consumed'!G2:G2001,'Fully Consumed'!K2:K2001,'Fully Consumed'!O2:O2001))/(SUMPRODUCT(Purchases!K3:K2002,Purchases!O3:O2002)+SUMPRODUCT('Fully Consumed'!K2:K2001,'Fully Consumed'!O2:O2001))","v":21.476698799902881},null,"> 93",{"$f":"F3*'Data Items'!$AK$43","v":259},{"$f":"SUM('Data Items'!I3:I9)","v":0.44122657580919933},null,"$10-$15",{"$f":"COUNTIF(Inventory!$L$2:$L$1001,M4)-SUM($I$2:I2)","v":6},null,2,{"$f":"COUNTIF(Inventory!$H$2:$H$1001,K3)","v":18},"<10"]
["Average Rating Score per Bottle",{"$f":"(SUMPRODUCT(Purchases!H3:H2002,Purchases!K3:K2002,Purchases!P3:P2002)+SUMPRODUCT('Fully Consumed'!H2:H2001,'Fully Consumed'!K2:K2001,'Fully Consumed'!P2:P2001))/(SUMPRODUCT(Purchases!K3:K2002,Purchases!P3:P2002)+SUMPRODUCT('Fully Consumed'!K2:K2001,'Fully Consumed'!P2:P2001))","v":92.359125315391083},null,"> 92",{"$f":"F4*'Data Items'!AK43","v":361},{"$f":"SUM('Data Items'!I3:I10)","v":0.61499148211243615},null,"$15-$20",{"$f":"COUNTIF(Inventory!$L$2:$L$1001,M5)-SUM($I$2:I3)","v":20},null,3,{"$f":"COUNTIF(Inventory!$H$2:$H$1001,K4)","v":9},"<15"]
["# Bottles",{"$f":"SUM(Purchases!K3:K2002)+SUM('Fully Consumed'!K2:K2001)","v":2378},null,"> 91",{"$f":"F5*'Data Items'!AK43","v":492},{"$f":"SUM('Data Items'!I3:I11)","v":0.83816013628620101},null,"$20-$25",{"$f":"COUNTIF(Inventory!$L$2:$L$1001,M6)-SUM($I$2:I4)","v":6},null,4,{"$f":"COUNTIF(Inventory!$H$2:$H$1001,K5)","v":4},"<20"]
["Standard Bottle Equivalents …",null,null,"< 90",{"$f":"F6*'Data Items'!AK43","v":0},{"$f":"SUM('Data Items'!I14:I23)","v":0},null,"$25-$30",{"$f":"COUNTIF(Inventory!$L$2:$L$1001,M7)-SUM($I$2:I5)","v":6},null,5,{"$f":"COUNTIF(Inventory!$H$2:$H$1001,K6)","v":10},"<25"]
["Average $/Bottle",{"$f":"(SUMPRODUCT(Purchases!G3:G2001,Purchases!K3:K2001,Purchases!O3:O2001,Purchases!F3:F2001)+SUMPRODUCT('Fully Consumed'!G2:G2003,'Fully Consumed'!L2:L2003,'Fully Consumed'!P2:P2003,'Fully Consumed'!F2:F2003))/(SUMPRODUCT(Purchases!K3:K2001,Purchases!O3:O2001,Purchases!F3:F2001)+SUMPRODUCT('Fully Consumed'!L2:L2003,'Fully Consumed'!P2:P2003,'Fully Consumed'!F2:F2003))","v":29.441044622404082},null,"< 89",{"$f":"F7*'Data Items'!AK43","v":0},{"$f":"SUM('Data Items'!I15:I23)","v":0},null,"$30-$35",{"$f":"COUNTIF(Inventory!$L$2:$L$1001,M8)-SUM($I$2:I6)","v":5},null,6,{"$f":"COUNTIF(Inventory!$H$2:$H$1001,K7)","v":2},"<30"]
["Average Rating Score per Bottle",{"$f":"(SUMPRODUCT(Purchases!H3:H2001,Purchases!K3:K2001,Purchases!P3:P2001,Purchases!F3:F2001)+SUMPRODUCT('Fully Consumed'!H2:H2003,'Fully Consumed'!L2:L2003,'Fully Consumed'!Q2:Q2003,'Fully Consumed'!F2:F2003))/(SUMPRODUCT(Purchases!K3:K2001,Purchases!P3:P2001,Purchases!F3:F2001)+SUMPRODUCT('Fully Consumed'!L2:L2003,'Fully Consumed'!Q2:Q2003,'Fully Consumed'!F2:F2003))","v":93.153266331658287},null,"< 88",{"$f":"F8*'Data Items'!AK43","v":0},{"$f":"SUM('Data Items'!I16:I23)","v":0},null,"$35-$40",{"$f":"COUNTIF(Inventory!$L$2:$L$1001,M9)-SUM($I$2:I7)","v":9},null,7,{"$f":"COUNTIF(Inventory!$H$2:$H$1001,K8)","v":5},"<35"]
["# Bottles",{"$f":"(SUMPRODUCT(Purchases!K3:K2001,Purchases!F3:F2001)+SUMPRODUCT('Fully Consumed'!L2:L2003,'Fully Consumed'!F2:F2003))/0.75","v":995},null,null,null,null,null,"$40-$50",{"$f":"COUNTIF(Inventory!$L$2:$L$1001,M10)-SUM($I$2:I8)","v":14},null,8,{"$f":"COUNTIF(Inventory!$H$2:$H$1001,K9)","v":2},"<40"]
[null,null,null,null,null,null,null,"$50-$75",{"$f":"COUNTIF(Inventory!$L$2:$L$1001,M11)-SUM($I$2:I9)","v":21},null,9,{"$f":"COUNTIF(Inventory!$H$2:$H$1001,K10)","v":3},"<50"]
[null,null,null,null,null,null,null,"$75-$100",{"$f":"COUNTIF(Inventory!$L$2:$L$1001,M12)-SUM($I$2:I10)","v":3},null,10,{"$f":"COUNTIF(Inventory!$H$2:$H$1001,K11)","v":5},"<75"]
["On-Hand Wines",null,null,null,null,null,null,"$100-$150",{"$f":"COUNTIF(Inventory!$L$2:$L$1001,M13)-SUM($I$2:I11)","v":0},null,11,{"$f":"COUNTIF(Inventory!$H$2:$H$1001,K12)","v":6},"<100"]
["Actual Bottles …",null,null,null,null,null,null,"$150-$250",{"$f":"COUNTIF(Inventory!$L$2:$L$1001,M14)-SUM($I$2:I12)","v":1},null,12,{"$f":"COUNTIF(Inventory!$H$2:$H$1001,K13)","v":13},"<150"]
["# Bottles",{"$f":"SUM(Purchases!M3:M2002)","v":587},null,null,null,null,null,"$250-$500",{"$f":"COUNTIF(Inventory!$L$2:$L$1001,M15)-SUM($I$2:I13)","v":0},null,13,{"$f":"COUNTIF(Inventory!$H$2:$H$1001,K14)","v":0},"<250"]
["Average $",{"$f":"SUMPRODUCT(Purchases!G3:G2002,Purchases!M3:M2002,Purchases!O3:O2002)/SUMPRODUCT(Purchases!M3:M2002,Purchases!O3:O2002)","v":31.598743370089768},null,null,null,null,null,"$500-$1,000",{"$f":"COUNTIF(Inventory!$L$2:$L$1001,M16)-SUM($I$2:I14)","v":0},null,14,{"$f":"COUNTIF(Inventory!$H$2:$H$1001,K15)","v":0},"<500"]
["Average Rating Score",{"$f":"SUMPRODUCT(Purchases!H3:H2002,Purchases!M3:M2002,Purchases!P3:P2002)/SUMPRODUCT(Purchases!M3:M2002,Purchases!P3:P2002)","v":93.470187393526402},null,null,null,null,null,"> $1,000",{"$f":"COUNTIF(Inventory!$L$2:$L$1001,M17)","v":0},null,15,{"$f":"COUNTIF(Inventory!$H$2:$H$1001,K16)","v":0},"<1000"]
["Average Age (Days)",{"$f":"B18*365","v":2428.7063351457496},null,null,null,null,null,null,null,null,16,{"$f":"COUNTIF(Inventory!$H$2:$H$1001,K17)","v":0},">=1000"]
["Average Age (Years)",{"$f":"'Data Items'!AK42","v":6.6539899593034235},null,null,null,null,null,null,null,null,17,{"$f":"COUNTIF(Inventory!$H$2:$H$1001,K18)","v":0}]
["Zero-Inventory Date",{"$f":"NOW()+B14*7/BottlesPerWeek","v":"2018-07-17T13:27:03.269"},null,null,null,null,null,null,null,null,18,{"$f":"COUNTIF(Inventory!$H$2:$H$1001,K19)","v":1}]
["Bottles Consumed per Week",{"$f":"(B5-B14-SUMIF(Purchases!J3:J2002,\"\",Purchases!K3:K2002))/(NOW()-CellarTrackingDt)*7","v":3.9703661236755958},null,null,null,null,null,null,null,null,19,{"$f":"COUNTIF(Inventory!$H$2:$H$1001,K20)","v":0}]
["3-Mnth Avg Btls per Week",{"$f":"(OFFSET('Data Items'!$AU$20,CellarUpdateCount,0)+OFFSET('Data Items'!$AU$20,CellarUpdateCount-1,0)+OFFSET('Data Items'!$AU$20,CellarUpdateCount-2,0))/3*7","v":3.5855556825796762},null,null,null,null,null,null,null,null,20,{"$f":"COUNTIF(Inventory!$H$2:$H$1001,K21)","v":1}]
["Total $",{"$f":"B14*B15","v":18548.462358242694},null,null,null,null,null,null,null,null,21,{"$f":"COUNTIF(Inventory!$H$2:$H$1001,K22)","v":0}]
["Standard Bottle Equivalents …",null,null,null,null,null,null,null,null,null,22,{"$f":"COUNTIF(Inventory!$H$2:$H$1001,K23)","v":1}]
["# Bottles",{"$f":"SUMPRODUCT(Purchases!M3:M2002,Purchases!F3:F2002)/0.75","v":584.5},null,null,null,null,null,null,null,null,23,{"$f":"COUNTIF(Inventory!$H$2:$H$1001,K24)","v":0}]
["Average $",{"$f":"SUMPRODUCT(Purchases!G3:G2002,Purchases!M3:M2002,Purchases!O3:O2002,Purchases!F3:F2002)/SUMPRODUCT(Purchases!M3:M2002,Purchases!O3:O2002,Purchases!F3:F2002)","v":31.526112669655404},null,null,null,null,null,null,null,null,24,{"$f":"COUNTIF(Inventory!$H$2:$H$1001,K25)","v":1}]
["Average Rating Score",{"$f":"SUMPRODUCT(Purchases!H3:H2001,Purchases!M3:M2001,Purchases!P3:P2001,Purchases!F3:F2001)/SUMPRODUCT(Purchases!M3:M2001,Purchases!P3:P2001,Purchases!F3:F2001)","v":93.474764756201878},null,null,null,null,null,null,null,null,"> 24",{"$f":"COUNTIF(Inventory!$H$2:$H$1001,K26)","v":0}]
[]
["On-Order Wines"]
["On-Order # Bottles",{"$f":"SUMIF(Purchases!J3:J2002,\"\",Purchases!K3:K2002)","v":0}]

{"sheet":"Purchases","index":3,"n_rows":415,"n_cols":72,"rows_kept":415,"cut":false,"hidden":false,"merged":[]}
[]
["Winery","Year","Detailed Varietal Info","Varietal Type","Wine Name","Bottle Size","Price (inclusive)","Rating Score "," Purchase Date","Cellar Date","# Bottles","Purchased From","On-Hand","Purchase Value On-Hand","Include Cost","Include Score","Score * Include","Bin #","Closure","# Corked","Combined Reference","Referenc Check","Unusd","Date 1","Taste Note 1","Date 2","Taste Note 2","Date 3","Taste Note 3","Date 4","Taste Note 4","Date 5","Taste Note 5","Date 6","Taste Note 6","Date 7","Taste Note 7","Date 8","Taste Note 8","Date 9","Taste Note 9","Date 10","Taste Note 10","Date 11","Taste Note 11","Date 12","Taste Note 12","Date 13","Taste Note 13","Date 14","Taste Note 14","Date 15","Taste Note 15","Date 16","Taste Note 16","Date 17","Taste Note 17","Date 18","Taste Note 18","Date 19","Taste Note 19","Date 20","Taste Note 20","Date 21","Taste Note 21","Date 22","Taste Note 22","Date 23","Taste Note 23","Date 24","Taste Note 24","Shipping Method"]
["Vina Herminia",2005,"Tempranillo","Tempranillo Blend","Rioja Reserva",0.75,22.154935837388038,93,"2012-03-22","2012-05-16",12,"Vendor 65",12,{"$f":"M3*G3","v":265.85923004865646},1,1,{"$f":"H3*P3","v":93},null,null,0,{"$f":"A3&\" | \"&B3&\" | \"&C3&\" | \"&E3&\" | \"&F3&\" L\"","v":"Vina Herminia | 2005 | Tempranillo | Rioja Reserva | 0.75 L"},{"$f":"MATCH(U3,Inventory!$A$2:$A$2001,0)","v":29}]
["Vignerons de Caractere",2009,"Grenache (50), Syrah (40), Mouvedre (10)","Grenache Blend","Vacqueyras Cuvée Prestige",0.75,13.12085794866085,91,"2012-01-26","2012-02-01",12,"Vendor 16",2,26.241715897321701,1,1,91,null,null,0,"Vignerons de Caractere | 2009 | Grenache (50), Syrah (40), Mouvedre (10) | Vacqueyras Cuvée Prestige | 0.75 L",{"$f":"MATCH(U4,Inventory!$A$2:$A$2001,0)","v":9}]
["Tyrus Evan",2007,"Syrah","Shiraz/Syrah","Syrah Walla Walla Valley",0.75,39.090795611470938,95,"2010-11-15","2010-11-18",12,"Vendor 16",5,195.45397805735468,1,1,95,null,null,0,"Tyrus Evan | 2007 | Syrah | Syrah Walla Walla Valley | 0.75 L",{"$f":"MATCH(U5,Inventory!$A$2:$A$2001,0)","v":43}]
["Two Hands",2005,"Shiraz","Shiraz/Syrah","Bella's Garden Barossa Valley",0.75,53.077495405197141,95,"2007-06-14","2007-06-14",12,"Vendor 11",4,212.30998162078856,1,1,95,null,"Cork (TBD)",0,"Two Hands | 2005 | Shiraz | Bella's Garden Barossa Valley | 0.75 L",{"$f":"MATCH(U6,Inventory!$A$2:$A$2001,0)","v":75}]
["Turley",2013,"Zinfandel","Zinfandel","Zinfandel Mead Ranch",0.75,49.699168730735778,92,"2015-01-27","2015-04-14",2,"Vendor 50",2,99.398337461471556,1,1,92,null,null,0,"Turley | 2013 | Zinfandel | Zinfandel Mead Ranch | 0.75 L",{"$f":"MATCH(U7,Inventory!$A$2:$A$2001,0)","v":77}]
["Turley",2013,"Zinfandel","Zinfandel","Zinfandel Duarte Vineyard",0.75,41.881876041412355,90,"2015-01-27","2015-04-14",2,"Vendor 50",2,83.763752082824709,1,1,90,null,null,0,"Turley | 2013 | Zinfandel | Zinfandel Duarte Vineyard | 0.75 L",{"$f":"MATCH(U8,Inventory!$A$2:$A$2001,0)","v":74}]
["Torzi Matthews",2007,"Syrah","Shiraz/Syrah","Schist Rock Eden Valley",0.75,17.28210423347354,92,"2008-10-25","2008-10-25",12,"Vendor 64",2,34.564208466947079,1,1,92,null,"Screwtop",0,"Torzi Matthews | 2007 | Syrah | Schist Rock Eden Valley | 0.75 L",{"$f":"MATCH(U9,Inventory!$A$2:$A$2001,0)","v":35}]
["Tommasi",2011,"Sangiovese & Cab S","Sangiovese Blend","Poggio Al Tufo Rompicollo",0.75,14.522126151800157,92,"2014-05-06","2014-05-10",12,"Vendor 66",12,174.26551382160187,1,1,92,null,null,0,"Tommasi | 2011 | Sangiovese & Cab S | Poggio Al Tufo Rompicollo | 0.75 L",{"$f":"MATCH(U10,Inventory!$A$2:$A$2001,0)","v":69}]
["Thorn Clarke",2005,"Shiraz","Shiraz/Syrah","Barossa Shotfire Ridge",0.75,15.975121090561151,92,"2007-04-12","2007-04-12",24,"Vendor 43",2,31.950242181122302,1,1,92,null,"Cork (TBD)",0,"Thorn Clarke | 2005 | Shiraz | Barossa Shotfire Ridge | 0.75 L",{"$f":"MATCH(U11,Inventory!$A$2:$A$2001,0)","v":21}]
["Vina Santa Rita",2009,"Syrah","Shiraz/Syrah","Syrah Maipo Valley Reserva",0.75,12.642867637932302,92,"2015-06-04","2015-06-05",24,"Vendor 13",18,227.57161748278142,1,1,92,null,null,0,"Vina Santa Rita | 2009 | Syrah | Syrah Maipo Valley Reserva | 0.75 L",{"$f":"MATCH(U12,Inventory!$A$2:$A$2001,0)","v":44}]
["Terrabianca",2007,"Sangiovese & Cab S","Sangiovese Blend","Toscana Campaccio",0.75,20.035330080598591,93,"2011-11-18","2011-11-22",12,"Vendor 57",2,40.070660161197182,1,1,93,null,null,0,"Terrabianca | 2007 | Sangiovese & Cab S | Toscana Campaccio | 0.75 L",{"$f":"MATCH(U13,Inventory!$A$2:$A$2001,0)","v":12}]
["Vinos de Arganza",2012,"Mencia","Mencia","Viño de la Tierra de Castilla y León Lagar de Robla Premium ",0.75,8.7678270436525345,91,"2015-06-19","2015-06-22",12,"Vendor 13",12,105.21392452383041,1,1,91,null,null,0,"Vinos de Arganza | 2012 | Mencia | Viño de la Tierra de Castilla y León Lagar de Robla Premium  | 0.75 L",{"$f":"MATCH(U14,Inventory!$A$2:$A$2001,0)","v":53}]
["Tensley",2008,"Syrah","Shiraz/Syrah","Santa Barbara County Colson Canyon V",0.75,37.834360173851252,95,"2009-12-08","2009-12-16",12,"Vendor 45",5,189.17180086925626,1,1,95,null,"Cork (TBD)",0,"Tensley | 2008 | Syrah | Santa Barbara County Colson Canyon V | 0.75 L",{"$f":"MATCH(U15,Inventory!$A$2:$A$2001,0)","v":70}]
["Symington Family",2011,"ouriga Franca, Tinta Roriz and Tinta Barroca","Touriga Blend","Douro Altano",0.75,10.686306729078293,91,"2014-05-12","2014-05-13",24,"Vendor 42",7,74.804147103548047,1,1,91,null,null,0,"Symington Family | 2011 | ouriga Franca, Tinta Roriz and Tinta Barroca | Douro Altano | 0.75 L",{"$f":"MATCH(U16,Inventory!$A$2:$A$2001,0)","v":78}]
["Shingleback",2004,"Shiraz","Shiraz/Syrah","McLaren Vale",0.75,18.275061944067481,91,"2007-05-02","2007-05-02",24,"Vendor 26",2,36.550123888134962,1,1,91,null,"Cork (TBD)",0,"Shingleback | 2004 | Shiraz | McLaren Vale | 0.75 L",{"$f":"MATCH(U17,Inventory!$A$2:$A$2001,0)","v":8}]
["Seghesio",2005,"Zinfandel","Zinfandel","Sonoma County",0.75,19.201149097442627,90,"2007-02-27","2007-02-27",12,"Vendor 11",1,19.201149097442627,1,1,90,null,"Cork (TBD)",0,"Seghesio | 2005 | Zinfandel | Sonoma County | 0.75 L",{"$f":"MATCH(U18,Inventory!$A$2:$A$2001,0)","v":2}]
["Schloss Lieser",2010,"Riesling","Riesling","Riesling Spätlese Mosel Lieser Niederberg Helden",0.75,32.830784297883511,95,"2012-05-22","2012-05-23",9,"Vendor 71",7,229.81549008518459,1,1,95,null,"Cork (Natural)",0,"Schloss Lieser | 2010 | Riesling | Riesling Spätlese Mosel Lieser Niederberg Helden | 0.75 L",{"$f":"MATCH(U19,Inventory!$A$2:$A$2001,0)","v":76}]
["Schild",2011,"Shiraz","Shiraz/Syrah","Barossa",0.75,16.716873425424101,90,"2013-09-02","2013-09-11",12,"Vendor 23",10,167.168734254241,1,1,90,null,null,0,"Schild | 2011 | Shiraz | Barossa | 0.75 L",{"$f":"MATCH(U20,Inventory!$A$2:$A$2001,0)","v":80}]
["Schild",2009,"Shiraz","Shiraz/Syrah","Barossa",0.75,17.618577141582968,92,"2012-01-25","2012-01-30",24,"Vendor 59",22,387.6086971148253,1,1,92,null,"Screwtop",0,"Schild | 2009 | Shiraz | Barossa | 0.75 L",{"$f":"MATCH(U21,Inventory!$A$2:$A$2001,0)","v":26}]
["Schild",2008,"Shiraz","Shiraz/Syrah","Barossa",0.75,19.315271716713905,94,"2010-12-17","2010-12-21",24,"Vendor 60",24,463.5665212011337,1,1,94,null,"Screwtop",0,"Schild | 2008 | Shiraz | Barossa | 0.75 L",{"$f":"MATCH(U22,Inventory!$A$2:$A$2001,0)","v":28}]
["Schild",2007,"Shiraz","Shiraz/Syrah","Barossa",0.75,18.380019677907228,92,"2009-12-16","2009-12-22",12,"Vendor 15",12,220.56023613488674,1,1,92,null,"Screwtop",0,"Schild | 2007 | Shiraz | Barossa | 0.75 L",{"$f":"MATCH(U23,Inventory!$A$2:$A$2001,0)","v":20}]
["Schild",2005,"Shiraz","Shiraz/Syrah","Barossa",0.75,22.636151708364487,93,"2007-07-18","2007-07-18",12,"Vendor 66",7,158.45306195855142,1,1,93,null,"Screwtop",0,"Schild | 2005 | Shiraz | Barossa | 0.75 L",{"$f":"MATCH(U24,Inventory!$A$2:$A$2001,0)","v":48}]
["San Filippo",2004,"Brunello","Brunello","Le Lucere Brunello",0.75,47.516778975814582,96,"2009-06-11","2009-06-13",10,"Vendor 17",5,237.58389487907291,1,1,96,null,"Cork (TBD)",0,"San Filippo | 2004 | Brunello | Le Lucere Brunello | 0.75 L",{"$f":"MATCH(U25,Inventory!$A$2:$A$2001,0)","v":87}]
["Viticcio",2007,"Sangiovese","Sangiovese","Chianti Classico Riserva",0.75,21.61178493142128,93,"2012-09-03","2012-09-06",12,"Vendor 66",9,194.50606438279152,1,1,93,null,null,0,"Viticcio | 2007 | Sangiovese | Chianti Classico Riserva | 0.75 L",{"$f":"MATCH(U26,Inventory!$A$2:$A$2001,0)","v":52}]
["Rocland",2009,"Shiraz","Shiraz/Syrah","Chocolate Box Dark Chocolate Shizaz",0.75,15.627852534681558,91,"2012-01-13","2012-01-18",12,"Vendor 42",1,15.627852534681558,1,1,91,null,"Screwtop",0,"Rocland | 2009 | Shiraz | Chocolate Box Dark Chocolate Shizaz | 0.75 L",{"$f":"MATCH(U27,Inventory!$A$2:$A$2001,0)","v":4}]
["Riccardo Baracchi",2010,"Syrah","Shiraz/Syrah","Cortona Smeriglio",0.75,19.273108085811138,93,"2013-04-08","2013-04-11",12,"Vendor 1",11,212.00418894392251,1,1,93,null,null,0,"Riccardo Baracchi | 2010 | Syrah | Cortona Smeriglio | 0.75 L",{"$f":"MATCH(U28,Inventory!$A$2:$A$2001,0)","v":41}]
["Reynvaan Family Vineyards",2012,"Syrah","Shiraz/Syrah","The Contender",0.75,85.377964328527455,94,"2013-10-22","2014-10-20",3,"Vendor 40",2,170.75592865705491,1,1,94,null,"Cork (Natural)",0,"Reynvaan Family Vineyards | 2012 | Syrah | The Contender | 0.75 L",{"$f":"MATCH(U29,Inventory!$A$2:$A$2001,0)","v":25}]
["Reynvaan Family Vineyards",2012,"Syrah","Shiraz/Syrah","In the Rocks",0.75,74.332156276702875,94,"2013-10-22","2014-10-20",3,"Vendor 40",2,148.66431255340575,1,1,94,null,"Cork (Natural)",0,"Reynvaan Family Vineyards | 2012 | Syrah | In the Rocks | 0.75 L",{"$f":"MATCH(U30,Inventory!$A$2:$A$2001,0)","v":46}]
["Reynvaan Family Vineyards",2011,"Syrah","Shiraz/Syrah","In the Rocks",0.75,74.094558855980637,93,"2013-03-04","2013-11-06",3,"Vendor 40",1,74.094558855980637,1,1,93,null,null,0,"Reynvaan Family Vineyards | 2011 | Syrah | In the Rocks | 0.75 L",{"$f":"MATCH(U31,Inventory!$A$2:$A$2001,0)","v":68}]
["Rex Hill",2009,"Pinot Noir","Pinot Noir","Willamette Valley Pinot Noir",0.75,25.288339542984964,93,"2011-08-29","2011-08-30",12,"Vendor 13",7,177.01837680089474,1,1,93,null,"Cork (Natural)",0,"Rex Hill | 2009 | Pinot Noir | Willamette Valley Pinot Noir | 0.75 L",{"$f":"MATCH(U32,Inventory!$A$2:$A$2001,0)","v":79}]
["Ravines",2012,"Riesling","Riesling","Riesling Finger Lakes Dry",0.75,15.861893932908774,91,"2013-08-19","2013-08-22",12,"Vendor 13",5,79.309469664543869,1,1,91,null,null,0,"Ravines | 2012 | Riesling | Riesling Finger Lakes Dry | 0.75 L",{"$f":"MATCH(U33,Inventory!$A$2:$A$2001,0)","v":14}]
["Quinta do Vale Meao",2004,"Touriga Nacionale, Touriga Franca, Toriga Roriz, Tinta Barroca","Touriga Blend","Douro",0.75,54.956125013351439,97,"2007-12-20","2007-12-20",6,"Vendor 74",4,219.82450005340576,1,1,97,null,"Cork (TBD)",0,"Quinta do Vale Meao | 2004 | Touriga Nacionale, Touriga Franca, Toriga Roriz, Tinta Barroca | Douro | 0.75 L",{"$f":"MATCH(U34,Inventory!$A$2:$A$2001,0)","v":17}]
["Punset",2007,"Nebbiolo","Nebbiolo","Barbaresco ",0.75,39.448836318254472,95,"2012-09-24","2012-09-25",12,"Vendor 16",11,433.93719950079918,1,1,95,null,null,0,"Punset | 2007 | Nebbiolo | Barbaresco  | 0.75 L",{"$f":"MATCH(U35,Inventory!$A$2:$A$2001,0)","v":31}]
["Proper Wines",2011,"Syrah","Shiraz/Syrah","Proper Syrah",0.75,30.219974155426026,90,"2013-11-02","2013-11-18",12,"Vendor 39",9,271.97976739883421,1,1,90,null,null,0,"Proper Wines | 2011 | Syrah | Proper Syrah | 0.75 L",{"$f":"MATCH(U36,Inventory!$A$2:$A$2001,0)","v":86}]
["Prats & Symington",2011,"Touriga Nacional & Touriga Franca","Touriga Blend","Duoro Chryseia",0.75,53.93983243808151,97,"2014-04-14","2014-04-16",12,"Vendor 64",5,269.69916219040755,1,1,97,null,null,0,"Prats & Symington | 2011 | Touriga Nacional & Touriga Franca | Duoro Chryseia | 0.75 L",{"$f":"MATCH(U37,Inventory!$A$2:$A$2001,0)","v":92}]
["Poggio il Castellare",2004,"Brunello","Brunello","Brunello di Montalcino",0.75,40.463845446705818,96,"2009-03-16","2009-10-06",12,"Vendor 16",6,242.78307268023491,1,1,96,null,"Cork (TBD)",0,"Poggio il Castellare | 2004 | Brunello | Brunello di Montalcino | 0.75 L",{"$f":"MATCH(U38,Inventory!$A$2:$A$2001,0)","v":1}]
["Pillar Box",2008,"Shiraz","Shiraz/Syrah","Reserve Shiraz",0.75,16.224970557212828,92,"2011-07-02","2011-07-06",12,"Vendor 64",12,194.69964668655393,1,1,92,null,null,0,"Pillar Box | 2008 | Shiraz | Reserve Shiraz | 0.75 L",{"$f":"MATCH(U39,Inventory!$A$2:$A$2001,0)","v":67}]
["Pierre Amadieu",2010,"Grenache (80), Syrah (20)","Grenache Blend","Vacqueyras La Grangelière",0.75,16.773512588560582,92,"2012-09-27","2012-09-28",12,"Vendor 48",2,33.547025177121164,1,1,92,null,null,0,"Pierre Amadieu | 2010 | Grenache (80), Syrah (20) | Vacqueyras La Grangelière | 0.75 L",{"$f":"MATCH(U40,Inventory!$A$2:$A$2001,0)","v":81}]
["Phillipe Delesvaux",2004,"Chenin Blanc","Chenin Blanc","Coteaux du Layon Selection de Grains Nobles",0.5,36.003831911474464,95,"2008-07-08","2008-07-08",6,"Vendor 21",3,108.01149573442339,1,1,95,null,"Cork (TBD)",0,"Phillipe Delesvaux | 2004 | Chenin Blanc | Coteaux du Layon Selection de Grains Nobles | 0.5 L",{"$f":"MATCH(U41,Inventory!$A$2:$A$2001,0)","v":33}]
["Peter Lehmann",2005,"Shiraz","Shiraz/Syrah","Shiraz Barossa",0.75,15.400404810905457,91,"2008-04-16","2008-04-16",24,"Vendor 65",1,15.400404810905457,1,1,91,null,"Cork (TBD)",0,"Peter Lehmann | 2005 | Shiraz | Shiraz Barossa | 0.75 L",{"$f":"MATCH(U42,Inventory!$A$2:$A$2001,0)","v":40}]
["Pelissero",2006,"Nebbiolo & Barbera","Nebbiolo Blend","Langhe Long Now",0.75,34.502530360937122,95,"2012-04-10","2012-09-19",12,"Vendor 44",9,310.52277324843408,1,1,95,null,"Cork (Natural)",0,"Pelissero | 2006 | Nebbiolo & Barbera | Langhe Long Now | 0.75 L",{"$f":"MATCH(U43,Inventory!$A$2:$A$2001,0)","v":63}]
["Palagetto",2006,"Syrah","Shiraz/Syrah","Syrah Toscana Uno di Quattro",0.75,37.662450019061566,96,"2010-10-21","2011-05-20",12,"Vendor 44",7,263.63715013343096,1,1,96,null,null,0,"Palagetto | 2006 | Syrah | Syrah Toscana Uno di Quattro | 0.75 L",{"$f":"MATCH(U44,Inventory!$A$2:$A$2001,0)","v":32}]
["Owen Roe",2008,"Syrah","Shiraz/Syrah","Yakima Valley Red Willow Vineyard",0.75,48.857803633630276,97,"2010-06-14","2010-06-23",6,"Vendor 2",3,146.57341090089082,1,1,97,null,"Cork (TBD)",0,"Owen Roe | 2008 | Syrah | Yakima Valley Red Willow Vineyard | 0.75 L",{"$f":"MATCH(U45,Inventory!$A$2:$A$2001,0)","v":65}]
["No Girls Wines",2011,"Grenache","Grenache","La Paciencia Vineyard",0.75,87.188406260490424,92,"2015-01-21","2015-03-19",3,"Vendor 34",3,261.56521878147129,1,1,92,null,null,0,"No Girls Wines | 2011 | Grenache | La Paciencia Vineyard | 0.75 L",{"$f":"MATCH(U46,Inventory!$A$2:$A$2001,0)","v":19}]
["No Girls Wines",2010,"Grenache","Grenache","La Paciencia Vineyard",0.75,77.156939283013344,92,"2014-01-15","2015-03-27",3,"Vendor 34",1,77.156939283013344,1,1,92,null,null,0,"No Girls Wines | 2010 | Grenache | La Paciencia Vineyard | 0.75 L",{"$f":"MATCH(U47,Inventory!$A$2:$A$2001,0)","v":55}]
["No Girls Wines",2009,"Syrah","Shiraz/Syrah","La Paciencia Vineyard",0.75,71.274785234212871,98,"2013-01-16","2013-03-12",3,"Vendor 34",2,142.54957046842574,1,1,98,null,null,0,"No Girls Wines | 2009 | Syrah | La Paciencia Vineyard | 0.75 L",{"$f":"MATCH(U48,Inventory!$A$2:$A$2001,0)","v":10}]
["No Girls Wines",2008,"Syrah","Shiraz/Syrah","La Paciencia Vineyard",0.75,55.283312246203423,96,"2012-02-14","2012-03-15",3,"Vendor 34",2,110.56662449240685,1,1,96,null,"Cork (Natural)",0,"No Girls Wines | 2008 | Syrah | La Paciencia Vineyard | 0.75 L",{"$f":"MATCH(U49,Inventory!$A$2:$A$2001,0)","v":37}]
["Neyers",2007,"Syrah","Shiraz/Syrah Blend","Sonoma Coast Old Lakeville Road ",0.75,31.551907622337342,94,"2009-04-11","2009-04-21",12,"Vendor 31",3,94.655722867012031,1,1,94,null,"Cork (TBD)",0,"Neyers | 2007 | Syrah | Sonoma Coast Old Lakeville Road  | 0.75 L",{"$f":"MATCH(U50,Inventory!$A$2:$A$2001,0)","v":64}]
["Massolino",2009,"Nebbiolo","Nebbiolo","Barolo",0.75,40.558818307310347,95,"2014-06-02","2014-06-03",12,"Vendor 48",12,486.70581968772416,1,1,95,null,null,0,"Massolino | 2009 | Nebbiolo | Barolo | 0.75 L",{"$f":"MATCH(U51,Inventory!$A$2:$A$2001,0)","v":88}]
["Marchesi de' Frescobaldi",2007,"Cab S, Merlot, Cab F, Sangiovese","Cab S Blend","Tenuta di Castiglioni Toscana Rosso",0.75,19.053389536917212,93,"2009-12-17","2009-12-19",12,"Vendor 59",12,228.64067444300656,1,1,93,null,"Cork (TBD)",0,"Marchesi de' Frescobaldi | 2007 | Cab S, Merlot, Cab F, Sangiovese | Tenuta di Castiglioni Toscana Rosso | 0.75 L",{"$f":"MATCH(U52,Inventory!$A$2:$A$2001,0)","v":82}]
["Bodegas Marques de Carrion",2009,"Tempranillo Blend","Tempranillo Blend","Rioja Antaño Reserva",0.75,9.8130061732232576,91,"2015-06-19","2015-06-22",12,"Vendor 13",12,117.75607407867909,1,1,91,null,null,0,"Bodegas Marques de Carrion | 2009 | Tempranillo Blend | Rioja Antaño Reserva | 0.75 L",{"$f":"MATCH(U53,Inventory!$A$2:$A$2001,0)","v":27}]
["Vinos de Arganza",2012,"Mencia","Mencia","Viño de la Tierra de Castilla y León Lagar de Robla Premium ",0.75,9.1413317981958393,91,"2015-06-04","2015-06-05",12,"Vendor 13",8,73.130654385566714,1,1,91,null,null,0,"Vinos de Arganza | 2012 | Mencia | Viño de la Tierra de Castilla y León Lagar de Robla Premium  | 0.75 L",{"$f":"MATCH(U54,Inventory!$A$2:$A$2001,0)","v":53}]
["Limerick Lane",2013,"Petite Sirah","Petite Sirah","Petite Sirah",0.75,50.173848577767608,92,"2015-05-18","2015-06-10",2,"Vendor 24",1,50.173848577767608,1,1,92,null,null,0,"Limerick Lane | 2013 | Petite Sirah | Petite Sirah | 0.75 L",{"$f":"MATCH(U55,Inventory!$A$2:$A$2001,0)","v":47}]
["Le Vieux Donjon",2005,"Chateauneuf Du Pape","Grenache Blend","Chateauneuf Du Pape",0.75,44.68330212628841,95,"2007-09-18","2007-09-18",6,"Vendor 59",5,223.41651063144207,1,1,95,null,"Cork (TBD)",0,"Le Vieux Donjon | 2005 | Chateauneuf Du Pape | Chateauneuf Du Pape | 0.75 L",{"$f":"MATCH(U56,Inventory!$A$2:$A$2001,0)","v":13}]
["La Serena",2010,"Brunello (Sangiovese)","Brunello","Brunello di Montalcino",0.75,51.411071873575445,96,"2015-03-30","2015-03-30",12,"Vendor 75",12,616.93286248290531,1,1,96,null,null,0,"La Serena | 2010 | Brunello (Sangiovese) | Brunello di Montalcino | 0.75 L",{"$f":"MATCH(U57,Inventory!$A$2:$A$2001,0)","v":59}]
["La Serena",2001,"Brunello (Sangiovese)","Brunello","Brunello di Montalcino",0.75,53.553607642650604,96,"2006-10-16","2006-10-16",12,"Vendor 15",1,53.553607642650604,1,1,96,null,"Cork (TBD)",0,"La Serena | 2001 | Brunello (Sangiovese) | Brunello di Montalcino | 0.75 L",{"$f":"MATCH(U58,Inventory!$A$2:$A$2001,0)","v":7}]
["La Rioja Alta",2004,"Tempranillo","Tempranillo Blend","Rioja  Viña Ardanza Reserva",0.75,28.014443764954805,94,"2013-08-01","2013-08-02",12,"Vendor 59",12,336.17332517945766,1,1,94,null,null,0,"La Rioja Alta | 2004 | Tempranillo | Rioja  Viña Ardanza Reserva | 0.75 L",{"$f":"MATCH(U59,Inventory!$A$2:$A$2001,0)","v":45}]
["La Colombina",2010,"Brunello","Brunello","Brunello di Montalcino",0.75,36.258554069817066,95,"2015-06-04","2015-06-05",6,"Vendor 13",6,217.5513244189024,1,1,95,null,null,0,"La Colombina | 2010 | Brunello | Brunello di Montalcino | 0.75 L",{"$f":"MATCH(U60,Inventory!$A$2:$A$2001,0)","v":66}]
["Konzelmann",2008,"Riesling","Riesling","Riesling Icewine",0.375,50.407053977251053,90,"2011-11-16","2011-11-16",1,"Vendor 73",1,50.407053977251053,1,1,90,null,"Cork (Natural)",0,"Konzelmann | 2008 | Riesling | Riesling Icewine | 0.375 L",{"$f":"MATCH(U61,Inventory!$A$2:$A$2001,0)","v":38}]
["K Vintners",2014,"Syrah","Shiraz/Syrah","Rose",0.75,28.151621556401253,90,"2015-03-30","2015-04-20",4,"Vendor 19",2,56.303243112802505,1,1,90,null,null,0,"K Vintners | 2014 | Syrah | Rose | 0.75 L",{"$f":"MATCH(U62,Inventory!$A$2:$A$2001,0)","v":83}]
["K Vintners",2013,"Grenache","Grenache","The Boy Grenache",0.75,51.249693857252595,91,"2015-03-30","2015-04-20",4,"Vendor 19",3,153.74908157175778,1,1,91,null,null,0,"K Vintners | 2013 | Grenache | The Boy Grenache | 0.75 L",{"$f":"MATCH(U63,Inventory!$A$2:$A$2001,0)","v":11}]
["K Vintners",2012," Syrah","Shiraz/Syrah","The Beautiful",0.75,59.523628030300138,92,"2014-09-16","2014-10-27",4,"Vendor 19",3,178.57088409090042,1,1,92,null,null,0,"K Vintners | 2012 |  Syrah | The Beautiful | 0.75 L",{"$f":"MATCH(U64,Inventory!$A$2:$A$2001,0)","v":6}]
["K Vintners",2012,"Syrah","Shiraz/Syrah","River Rock Syrah",0.75,47.256094561189414,92,"2015-03-30","2015-04-20",4,"Vendor 19",3,141.76828368356826,1,1,92,null,null,0,"K Vintners | 2012 | Syrah | River Rock Syrah | 0.75 L",{"$f":"MATCH(U65,Inventory!$A$2:$A$2001,0)","v":16}]
["K Vintners",2012,"Merlot","Merlot","Northridge",0.75,46.374239461898803,92,"2015-03-30","2015-04-20",4,"Vendor 19",3,139.1227183856964,1,1,92,null,null,0,"K Vintners | 2012 | Merlot | Northridge | 0.75 L",{"$f":"MATCH(U66,Inventory!$A$2:$A$2001,0)","v":93}]
["K Vintners",2012,"Tempranillo","Tempranillo Blend","El Jefe",0.75,65.737307942748075,91,"2014-09-16","2014-10-27",4,"Vendor 19",1,{"$f":"M67*G67","v":65.737307942748075},1,1,{"$f":"H67*P67","v":91},null,null,0,{"$f":"A67&\" | \"&B67&\" | \"&C67&\" | \"&E67&\" | \"&F67&\" L\"","v":"K Vintners | 2012 | Tempranillo | El Jefe | 0.75 L"},{"$f":"MATCH(U67,Inventory!$A$2:$A$2001,0)","v":49}]
["K Vintners",2007,"Syrah","Shiraz/Syrah","Syrah Wahluke Slope Northridge",0.75,39.435055555522446,96,"2010-10-06","2010-10-15",3,"Vendor 58",2,78.870111111044892,1,1,96,null,null,0,"K Vintners | 2007 | Syrah | Syrah Wahluke Slope Northridge | 0.75 L",{"$f":"MATCH(U68,Inventory!$A$2:$A$2001,0)","v":24}]
["Jean-Luc Columbo",2010,"Syrah","Shiraz/Syrah","Cornas La Louvée",0.75,42.380535384744405,96,"2013-06-05","2013-06-06",12,"Vendor 1",12,508.56642461693286,1,1,96,null,null,0,"Jean-Luc Columbo | 2010 | Syrah | Cornas La Louvée | 0.75 L",{"$f":"MATCH(U69,Inventory!$A$2:$A$2001,0)","v":62}]
["Jaffurs",2007,"Syrah","Shiraz/Syrah","Santa Barbara County",0.75,26.52165807545185,94,"2008-11-15","2008-11-15",24,"Vendor 31",1,26.52165807545185,1,1,94,null,"Cork (TBD)",0,"Jaffurs | 2007 | Syrah | Santa Barbara County | 0.75 L",{"$f":"MATCH(U70,Inventory!$A$2:$A$2001,0)","v":5}]
["Inniskillin",2006,"Vidal","Vidal","Niagara Pennisula Vidal Ice Wine",0.375,60.242143929004669,91,"2009-08-15","2009-08-15",3,"Vendor 33",2,120.48428785800934,1,1,91,null,"Cork (TBD)",0,"Inniskillin | 2006 | Vidal | Niagara Pennisula Vidal Ice Wine | 0.375 L",{"$f":"MATCH(U71,Inventory!$A$2:$A$2001,0)","v":90}]
["I Balzini",2009,"Merlot, Cab S, Sangiovese","Merlot Blend","Red Label",0.75,18.401945322573184,93,"2013-02-07","2013-02-13",12,"Vendor 1",10,184.01945322573184,1,1,93,null,null,0,"I Balzini | 2009 | Merlot, Cab S, Sangiovese | Red Label | 0.75 L",{"$f":"MATCH(U72,Inventory!$A$2:$A$2001,0)","v":54}]
["Horsepower Vineyards",2012,"Syrah","Shiraz/Syrah","Sur Echalas Vineyard Syrah",0.75,151.27386105179787,93,"2015-01-14","2015-03-18",3,"Vendor 18",3,453.82158315539357,1,1,93,null,null,0,"Horsepower Vineyards | 2012 | Syrah | Sur Echalas Vineyard Syrah | 0.75 L",{"$f":"MATCH(U73,Inventory!$A$2:$A$2001,0)","v":15}]
["Hall",2006,"Cabernet Sauvignon ","Cab S","Cabernet Sauvignon Napa Valley",0.75,30.381921727895737,94,"2010-05-05","2010-05-07",12,"Vendor 43",8,243.05537382316589,1,1,94,null,"Cork (TBD)",0,"Hall | 2006 | Cabernet Sauvignon  | Cabernet Sauvignon Napa Valley | 0.75 L",{"$f":"MATCH(U74,Inventory!$A$2:$A$2001,0)","v":85}]
["Guy Saget",2011,"Chenin Blanc","Chenin Blanc","Marie Beauregard' Vouvray",0.75,16.950340564399955,92,"2013-04-09","2013-04-10",12,"Vendor 13",12,203.40408677279947,1,1,92,null,null,0,"Guy Saget | 2011 | Chenin Blanc | Marie Beauregard' Vouvray | 0.75 L",{"$f":"MATCH(U75,Inventory!$A$2:$A$2001,0)","v":50}]
["Giovanni Corino",2007,"Nebbiolo","Nebbiolo","Barolo",0.75,39.728670530021191,95,"2012-05-08","2012-05-10",12,"Vendor 13",11,437.0153758302331,1,1,95,null,null,0,"Giovanni Corino | 2007 | Nebbiolo | Barolo | 0.75 L",{"$f":"MATCH(U76,Inventory!$A$2:$A$2001,0)","v":23}]
["Fox Gordon",2004,"Shiraz","Shiraz/Syrah","Eight Uncles Barossa Valley",0.75,18.169395046323537,91,"2007-04-05","2007-04-05",12,"Vendor 65",2,36.338790092647073,1,1,91,null,"Cork (TBD)",0,"Fox Gordon | 2004 | Shiraz | Eight Uncles Barossa Valley | 0.75 L",{"$f":"MATCH(U77,Inventory!$A$2:$A$2001,0)","v":34}]
["Four Vines",2011,"Petite Sirah","Petite Sirah","Petite Sirah Paso Robles Skeptic",0.75,14.74816084742546,92,"2014-02-06","2014-04-07",12,"Vendor 31",12,176.97793016910552,1,1,92,null,null,0,"Four Vines | 2011 | Petite Sirah | Petite Sirah Paso Robles Skeptic | 0.75 L",{"$f":"MATCH(U78,Inventory!$A$2:$A$2001,0)","v":91}]
["Evening Land Vineyards",2012,"Pinot Noir","Pinot Noir","Seven Springs Vineyard, Eola Amity Hills",0.75,69.023494258791203,96,"2015-05-12","2015-05-20",6,"Vendor 14",5,345.11747129395599,1,1,96,null,null,0,"Evening Land Vineyards | 2012 | Pinot Noir | Seven Springs Vineyard, Eola Amity Hills | 0.75 L",{"$f":"MATCH(U79,Inventory!$A$2:$A$2001,0)","v":89}]
["Durand (Eric & Joel)",2010,"Syrah","Shiraz/Syrah","Cornas Premises",0.75,24.742856621563433,93,"2013-01-08","2013-01-10",12,"Vendor 16",10,247.42856621563433,1,1,93,null,null,0,"Durand (Eric & Joel) | 2010 | Syrah | Cornas Premises | 0.75 L",{"$f":"MATCH(U80,Inventory!$A$2:$A$2001,0)","v":61}]
["Vinosia",2004,"Aglianico","Aglianico","Taurasi",0.75,23.308868713676929,93,"2012-06-18","2012-06-26",12,"Vendor 65",10,233.08868713676929,1,1,93,null,"Cork (Natural)",0,"Vinosia | 2004 | Aglianico | Taurasi | 0.75 L",{"$f":"MATCH(U81,Inventory!$A$2:$A$2001,0)","v":73}]
["Dow",2011,"Port","Port","Vintage Porto",0.75,66.313264630794521,99,"2013-11-02","2013-11-06",4,"Vendor 48",4,265.25305852317808,1,1,99,null,null,0,"Dow | 2011 | Port | Vintage Porto | 0.75 L",{"$f":"MATCH(U82,Inventory!$A$2:$A$2001,0)","v":57}]
["Donatella Cinelli Colombini",2010,"Sangiovese","Brunello","Brunello di Montalcino Progetto Prime Donne",0.75,51.998870421588421,96,"2015-04-16","2015-04-18",12,"Vendor 27",12,623.986445059061,1,1,96,null,null,0,"Donatella Cinelli Colombini | 2010 | Sangiovese | Brunello di Montalcino Progetto Prime Donne | 0.75 L",{"$f":"MATCH(U83,Inventory!$A$2:$A$2001,0)","v":36}]
["Domaine Saint Prefert",2005,"Chateauneuf Du Pape","Grenache Blend","Reserve Auguste Favier",0.75,43.365293960273263,95,"2007-09-21","2007-09-21",12,"Vendor 10",10,433.65293960273266,1,1,95,null,"Cork (TBD)",0,"Domaine Saint Prefert | 2005 | Chateauneuf Du Pape | Reserve Auguste Favier | 0.75 L",{"$f":"MATCH(U84,Inventory!$A$2:$A$2001,0)","v":56}]
["Domaine Giraud",2010,"Chateauneuf du Pape","Grenache Blend","Chateauneuf du Pape Tradition",0.75,42.862664155453444,95,"2012-11-09","2012-11-15",12,"Vendor 3",11,471.48930570998789,1,1,95,null,null,0,"Domaine Giraud | 2010 | Chateauneuf du Pape | Chateauneuf du Pape Tradition | 0.75 L",{"$f":"MATCH(U85,Inventory!$A$2:$A$2001,0)","v":71}]
["Domaine du Vieux Télégraphe",2005,"Chateauneuf Du Pape","Grenache Blend","La Crau",0.75,46.878338634967804,95,"2008-06-01","2008-06-01",2,"Vendor 53",1,46.878338634967804,1,1,95,null,"Cork (TBD)",0,"Domaine du Vieux Télégraphe | 2005 | Chateauneuf Du Pape | La Crau | 0.75 L",{"$f":"MATCH(U86,Inventory!$A$2:$A$2001,0)","v":84}]
["Domaine des Baumard",2005,"Chenin Blanc","Chenin Blanc","Quarts de Chaume",0.75,63.181406445056197,98,"2007-10-24","2007-10-24",5,"Vendor 7",5,315.907032225281,1,1,98,null,"Cork (TBD)",0,"Domaine des Baumard | 2005 | Chenin Blanc | Quarts de Chaume | 0.75 L",{"$f":"MATCH(U87,Inventory!$A$2:$A$2001,0)","v":39}]
["Domaine des Baumard",2005,"Chenin Blanc","Chenin Blanc","Coteaux du Layon Carte d'Or",0.75,19.64972440522909,92,"2007-07-10","2007-07-10",12,"Vendor 64",2,39.299448810458181,1,1,92,null,"Screwtop",0,"Domaine des Baumard | 2005 | Chenin Blanc | Coteaux du Layon Carte d'Or | 0.75 L",{"$f":"MATCH(U88,Inventory!$A$2:$A$2001,0)","v":22}]
["Domaine de Beaurenard",2010,"Grenache blend","Grenache Blend","Châteauneuf-du-Pape Boisrenard",0.75,62.8216985168159,97,"2013-02-06","2013-03-26",12,"Vendor 56",11,691.0386836849749,1,1,97,null,null,0,"Domaine de Beaurenard | 2010 | Grenache blend | Châteauneuf-du-Pape Boisrenard | 0.75 L",{"$f":"MATCH(U89,Inventory!$A$2:$A$2001,0)","v":18}]
["Denner",2008,"Syrah & Viognier","Shiraz/Syrah Blend","Dirt Worshipper Paso Robles",0.75,53.108463820695881,97,"2010-12-22","2010-12-29",12,"Vendor 12",5,265.54231910347943,1,1,97,null,null,0,"Denner | 2008 | Syrah & Viognier | Dirt Worshipper Paso Robles | 0.75 L",{"$f":"MATCH(U90,Inventory!$A$2:$A$2001,0)","v":42}]
["d'Arenberg",2008,"Grenache, Shiraz, Mouvedre","Grenache Blend","The Stump Jump Red",0.75,11.889819927513599,90,"2010-01-20","2010-01-27",21,"Vendor 16",1,11.889819927513599,1,1,90,null,"Screwtop",0,"d'Arenberg | 2008 | Grenache, Shiraz, Mouvedre | The Stump Jump Red | 0.75 L",{"$f":"MATCH(U91,Inventory!$A$2:$A$2001,0)","v":3}]
["Corrina Rayment",2005,"Shiraz","Shiraz/Syrah","Expatriate Shiraz",0.75,42.870631153464316,95,"2008-05-09","2008-05-09",12,"Vendor 59",4,171.48252461385727,1,1,95,null,"Cork (TBD)",0,"Corrina Rayment | 2005 | Shiraz | Expatriate Shiraz | 0.75 L",{"$f":"MATCH(U92,Inventory!$A$2:$A$2001,0)","v":58}]
["Condado de Haza",2005,"Tempranillo Blend","Tempranillo Blend","Ribera del Duero Crianza",0.75,25.34472268089652,93,"2008-09-25","2008-09-25",12,"Vendor 13",8,202.75778144717216,1,1,93,null,"Cork (TBD)",0,"Condado de Haza | 2005 | Tempranillo Blend | Ribera del Duero Crianza | 0.75 L",{"$f":"MATCH(U93,Inventory!$A$2:$A$2001,0)","v":60}]
["Columbia Crest",2004,"Cabernet Sauvignon","Cab S","Columbia Valley Reserve",0.75,29.333681875824929,92,"2008-12-23","2008-12-23",12,"Vendor 72",5,146.66840937912465,1,1,92,null,"Cork (TBD)",0,"Columbia Crest | 2004 | Cabernet Sauvignon | Columbia Valley Reserve | 0.75 L",{"$f":"MATCH(U94,Inventory!$A$2:$A$2001,0)","v":30}]
["Chateau Tanunda",2008,"Syrah","Shiraz/Syrah","Grand Barossa Shiraz",0.75,15.234574278563262,92,"2011-11-07","2011-11-09",24,"Vendor 16",2,30.469148557126523,1,1,92,null,null,0,"Chateau Tanunda | 2008 | Syrah | Grand Barossa Shiraz | 0.75 L",{"$f":"MATCH(U95,Inventory!$A$2:$A$2001,0)","v":51}]
["Chateau Monbrison",2005,"Bordeaux blend","Cab S Blend","Grand Vin de Margaux",0.75,36.136961281895637,91,"2008-02-15","2008-02-15",11,"Vendor 36",11,397.50657410085199,1,1,91,null,"Cork (TBD)",0,"Chateau Monbrison | 2005 | Bordeaux blend | Grand Vin de Margaux | 0.75 L",{"$f":"MATCH(U96,Inventory!$A$2:$A$2001,0)","v":72}]
[]
[]
[]
[]
[]
[]
[]
[]
[]
[]
[]
[]
[]
[]
[]
[]
[]
[]
[]
[]
[]
[]
[]
[]
[]
[]
[]
[]
[]
[]
[]
[]
[]
[]
[]
[]
[]
[]
[]
[]
[]
[]
[]
[]
[]
[]
[]
[]
[]
[]
[]
[]
[]
[]
[]
[]
[]
[]
[]
[]
[]
[]
[]
[]
[]
[]
[]
[]
[]
[]
[]
[]
[]
[]
[]
[]
[]
[]
[]
[]
[]
[]
[]
[]
[]
[]
[]
[]
[]
[]
[]
[]
[]
[]
[]
[]
[]
[]
[]
[]
[]
[]
[]
[]
[]
[]
[]
[]
[]
[]
[]
[]
[]
[]
[]
[]
[]
[]
[]
[]
[]
[]
[]
[]
[]
[]
[]
[]
[]
[]
[]
[]
[]
[]
[]
[]
[]
[]
[]
[]
[]
[]
[]
[]
[]
[]
[]
[]
[]
[]
[]
[]
[]
[]
[]
[]
[]
[]
[]
[]
[]
[]
[]
[]
[]
[]
[]
[]
[]
[]
[]
[]
[]
[]
[]
[]
[]
[]
[]
[]
[]
[]
[]
[]
[]
[]
[]
[]
[]
[]
[]
[]
[]
[]
[]
[]
[]
[]
[]
[]
[]
[]
[]
[]
[]
[]
[]
[]
[]
[]
[]
[]
[null,null,null,null,null,null,null,97]
[]
[]
[]
[]
[]
[]
[]
[]
[]
[]
[]
[]
[]
[]
[]
[]
[]
[]
[]
[]
[]
[]
[]
[]
[]
[]
[]
[]
[]
[]
[]
[]
[]
[]
[]
[]
[]
[]
[]
[]
[]
[]
[]
[]
[]
[]
[]
[]
[]
[]
[]
[]
[]
[]
[]
[]
[]
[]
[]
[null,null,null,null,null,null,null,92]
[null,null,null,null,null,null,null,94]
[null,null,null,null,null,null,null,94]
[null,null,null,null,null,null,null,94]
[null,null,null,null,null,null,null,92]
[]
[]
[]
[]
[]
[]
[]
[]
[]
[]
[]
[]
[]
[]
[]
[]
[]
[]
[]
[]
[]
[]
[]
[]
[]
[]
[]
[]
[]
[]
[]
[]
[]
[]
[]
[]
[]
[]
[]
[]
[]
[null,null,null,null,null,null,null,90]

{"sheet":"Inventory","index":4,"n_rows":94,"n_cols":78,"rows_kept":94,"cut":false,"hidden":false,"merged":[]}
[9,"Verticals (# Vintages)","Hemisphere","Country","Vintage","Aged Days","# Purchased","# On-Hand","% Left","Drink-Now Score (see Report)","Rating Score","Averge Purchase Price","Current Price per Bottle","Location in Cellar","Drink Through","Drink From","Drink Days (see report)",{"$f":"YEAR(NOW())","v":2015},{"$f":"R1+1","v":2016},2017,2018,2019,2020,2021,2022,2023,2024,2025,2026,2027,2028,2029,2030,2031,2032,2033,2034,2035,2036,2037,2038,"Purchase Value OnHand","Current Value OnHand","Wine Color","Region","Origin",{"$f":"IF(LEN(CustomCategory1)>0,CustomCategory1,\"Custom Category 1\")","v":"Custom Category 1"},{"$f":"IF(LEN(CustomCategory2)>0,CustomCategory2,\"Custom Category 2\")","v":"Custom Category 2"},{"$f":"IF(LEN(CustomData1)>0,CustomData1,\"Custom Data 1\")","v":"Custom Data 1"},{"$f":"IF(LEN(CustomData2)>0,CustomData2,\"Custom Data 2\")","v":"Custom Data 2"},"Special Designation 1","Rating Score 1","Rating Source 1","Rating Score 2","Rating Source 2","Rating Score 3","Rating Source 3","County|Region","Country|Region|Origin","Corked Count","Varietal","Special Designation 2","Long-Hold",null,null,null,null,null,null,null,null,null,null,null,null,null,null,6]
["Poggio il Castellare | 2004 | Brunello | Brunello di Montalcino | 0.75 L",1,"N","IT",2004,{"$f":"NOW()-IF(C2=\"N\",DATE(E2,10,31),DATE(E2,4,31))","v":3972.6433027777748},{"$f":"SUMIF(Purchases!$U$3:$U$2002,A2,Purchases!$K$3:$K$2002)+SUMIF('Fully Consumed'!$U$2:$U$2001,A2,'Fully Consumed'!$K$2:$K$2001)","v":12},{"$f":"SUMIF(Purchases!$U$3:$U$2002,A2,Purchases!$M$3:$M$2001)","v":6},{"$f":"H2/G2","v":0.5},{"$f":"10/IF(H2>0,(K2/'Summary Stats'!$B$4)^3*(L2/'Summary Stats'!$B$3)^3*MAX((O2-$R$1+1)^2,0.001)*3^B2*IF(LEN(P2)=0,1,IF(P2>=$R$1,P2-$R$1+1,1/($R$1+1-P2))^2),1000000000)","v":1.2328297298780112E-2},96,{"$f":"IF(H2>0,SUMIF(Purchases!$U$3:$U$2002,A2,Purchases!$N$3:$N$2002)/H2,\"\")","v":40.463845446705818},40.01,null,2020,null,{"$f":"IF(AND(LEN(O2)>0,H2>0),(DATE(O2,12,31)-MAX(FLOOR(NOW(),1),DATE(P2,1,1)))/H2,\"\")","v":322.16666666666669},{"$f":"IF(R$1<=$O2,IF(AND(ISNUMBER(Q2),R$1>=$P2),(DATE(R$1,12,31)-INT(NOW()))/Q2,\"\"),H2)","v":0.32902224521469214},{"$f":"IF(ISNUMBER($Q2),IF(AND(S$1<=$O2,S$1>=$P2),365/$Q2,\"\"),\"\")","v":1.1329539575788929},1.1329539575788929,1.1329539575788929,1.1329539575788929,1.1329539575788929,"","","","","","","","","","","","","","","","","","",{"$f":"H2*L2","v":242.78307268023491},{"$f":"M2*H2","v":240.06},"Red",null,null,null,null,40491,null,"2004 Brunello",96,"Rater 2",null,null,null,null,{"$f":"D2&\"|\"&AS2","v":"IT|"},{"$f":"BF2&\"|\"&AT2","v":"IT||"},null,"Brunello",null,false,null,null,null,null,null,null,null,null,null,null,null,null,null,null,3]
["Seghesio | 2005 | Zinfandel | Sonoma County | 0.75 L",1,"N","US",2005,{"$f":"NOW()-IF(C3=\"N\",DATE(E3,10,31),DATE(E3,4,31))","v":3607.6433027777748},{"$f":"SUMIF(Purchases!$U$3:$U$2002,A3,Purchases!$K$3:$K$2002)+SUMIF('Fully Consumed'!$U$2:$U$2001,A3,'Fully Consumed'!$K$2:$K$2001)","v":12},{"$f":"SUMIF(Purchases!$U$3:$U$2002,A3,Purchases!$M$3:$M$2001)","v":1},{"$f":"H3/G3","v":8.3333333333333329E-2},{"$f":"10/IF(H3>0,(K3/'Summary Stats'!$B$4)^3*(L3/'Summary Stats'!$B$3)^3*MAX((O3-$R$1+1)^2,0.001)*3^B3*IF(LEN(P3)=0,1,IF(P3>=$R$1,P3-$R$1+1,1/($R$1+1-P3))^2),1000000000)","v":1.2602351218630572},90,{"$f":"IF(H3>0,SUMIF(Purchases!$U$3:$U$2002,A3,Purchases!$N$3:$N$2002)/H3,\"\")","v":19.201149097442627},18.32,null,2012,null,{"$f":"IF(AND(LEN(O3)>0,H3>0),(DATE(O3,12,31)-MAX(FLOOR(NOW(),1),DATE(P3,1,1)))/H3,\"\")","v":-989},{"$f":"IF(R$1<=$O3,IF(AND(ISNUMBER(Q3),R$1>=$P3),(DATE(R$1,12,31)-INT(NOW()))/Q3,\"\"),H3)","v":1},{"$f":"IF(ISNUMBER($Q3),IF(AND(S$1<=$O3,S$1>=$P3),365/$Q3,\"\"),\"\")","v":""},"","","","","","","","","",{"$f":"IF(ISNUMBER($Q3),IF(AND(AC$1<=$O3,AC$1>=$P3),365/$Q3,\"\"),\"\")","v":""},"","","","","","","","","","","","",{"$f":"H3*L3","v":19.201149097442627},{"$f":"M3*H3","v":18.32},"Red",null,null,null,null,"91-07",null,null,90,"Rater 2",null,null,null,null,{"$f":"D3&\"|\"&AS3","v":"US|"},{"$f":"BF3&\"|\"&AT3","v":"US||"},null,"Zinfandel",null,true]
["d'Arenberg | 2008 | Grenache, Shiraz, Mouvedre | The Stump Jump Red | 0.75 L",1,"S","AU",2008,2694.6433027777748,{"$f":"SUMIF(Purchases!$U$3:$U$2002,A4,Purchases!$K$3:$K$2002)+SUMIF('Fully Consumed'!$U$2:$U$2001,A4,'Fully Consumed'!$K$2:$K$2001)","v":21},{"$f":"SUMIF(Purchases!$U$3:$U$2002,A4,Purchases!$M$3:$M$2001)","v":1},4.7619047619047616E-2,{"$f":"10/IF(H4>0,(K4/'Summary Stats'!$B$4)^3*(L4/'Summary Stats'!$B$3)^3*MAX((O4-$R$1+1)^2,0.001)*3^B4*IF(LEN(P4)=0,1,IF(P4>=$R$1,P4-$R$1+1,1/($R$1+1-P4))^2),1000000000)","v":21230.85080204394},90,{"$f":"IF(H4>0,SUMIF(Purchases!$U$3:$U$2002,A4,Purchases!$N$3:$N$2002)/H4,\"\")","v":11.889819927513599},10.119999999999999,null,2014,null,-259,1,"","","","","","","","","","","","","","","","","","","","","","","",11.889819927513599,10.119999999999999,"Red",null,null,null,null,null,null,null,90,"Rater 2",null,null,null,null,"AU|","AU||",null,"Grenache Blend",null,true]
["Rocland | 2009 | Shiraz | Chocolate Box Dark Chocolate Shizaz | 0.75 L",1,"S","AU",2009,2329.6433027777748,{"$f":"SUMIF(Purchases!$U$3:$U$2002,A5,Purchases!$K$3:$K$2002)+SUMIF('Fully Consumed'!$U$2:$U$2001,A5,'Fully Consumed'!$K$2:$K$2001)","v":12},{"$f":"SUMIF(Purchases!$U$3:$U$2002,A5,Purchases!$M$3:$M$2001)","v":1},8.3333333333333329E-2,{"$f":"10/IF(H5>0,(K5/'Summary Stats'!$B$4)^3*(L5/'Summary Stats'!$B$3)^3*MAX((O5-$R$1+1)^2,0.001)*3^B5*IF(LEN(P5)=0,1,IF(P5>=$R$1,P5-$R$1+1,1/($R$1+1-P5))^2),1000000000)","v":9044.7937454731036},91,{"$f":"IF(H5>0,SUMIF(Purchases!$U$3:$U$2002,A5,Purchases!$N$3:$N$2002)/H5,\"\")","v":15.627852534681558},15.27,null,2014,null,-259,1,"","","","","","","","","","","","","","","","","","","","","","","",15.627852534681558,15.27,"Red",null,null,null,null,null,null,null,91,"Rater 2",null,null,null,null,"AU|","AU||",null,"Shiraz/Syrah",null,true]
["Jaffurs | 2007 | Syrah | Santa Barbara County | 0.75 L",1,"N","US",2007,{"$f":"NOW()-IF(C6=\"N\",DATE(E6,10,31),DATE(E6,4,31))","v":2877.6433027777748},{"$f":"SUMIF(Purchases!$U$3:$U$2002,A6,Purchases!$K$3:$K$2002)+SUMIF('Fully Consumed'!$U$2:$U$2001,A6,'Fully Consumed'!$K$2:$K$2001)","v":24},{"$f":"SUMIF(Purchases!$U$3:$U$2002,A6,Purchases!$M$3:$M$2001)","v":1},{"$f":"H6/G6","v":4.1666666666666664E-2},{"$f":"10/IF(H6>0,(K6/'Summary Stats'!$B$4)^3*(L6/'Summary Stats'!$B$3)^3*MAX((O6-$R$1+1)^2,0.001)*3^B6*IF(LEN(P6)=0,1,IF(P6>=$R$1,P6-$R$1+1,1/($R$1+1-P6))^2),1000000000)","v":1678.9400245572924},94,{"$f":"IF(H6>0,SUMIF(Purchases!$U$3:$U$2002,A6,Purchases!$N$3:$N$2002)/H6,\"\")","v":26.52165807545185},25.77,null,2014,null,{"$f":"IF(AND(LEN(O6)>0,H6>0),(DATE(O6,12,31)-MAX(FLOOR(NOW(),1),DATE(P6,1,1)))/H6,\"\")","v":-259},{"$f":"IF(R$1<=$O6,IF(AND(ISNUMBER(Q6),R$1>=$P6),(DATE(R$1,12,31)-INT(NOW()))/Q6,\"\"),H6)","v":1},{"$f":"IF(ISNUMBER($Q6),IF(AND(S$1<=$O6,S$1>=$P6),365/$Q6,\"\"),\"\")","v":""},"","","","","","","","","",{"$f":"IF(ISNUMBER($Q6),IF(AND(AC$1<=$O6,AC$1>=$P6),365/$Q6,\"\"),\"\")","v":""},"","","","","","","","","","","","",{"$f":"H6*L6","v":26.52165807545185},{"$f":"M6*H6","v":25.77},"Red",null,null,null,null,null,null,null,94,"Rater 2",null,null,null,null,{"$f":"D6&\"|\"&AS6","v":"US|"},{"$f":"BF6&\"|\"&AT6","v":"US||"},null,"Shiraz/Syrah",null,false]
["K Vintners | 2012 |  Syrah | The Beautiful | 0.75 L",1,"N","US",2012,1050.6433027777748,{"$f":"SUMIF(Purchases!$U$3:$U$2002,A7,Purchases!$K$3:$K$2002)+SUMIF('Fully Consumed'!$U$2:$U$2001,A7,'Fully Consumed'!$K$2:$K$2001)","v":4},{"$f":"SUMIF(Purchases!$U$3:$U$2002,A7,Purchases!$M$3:$M$2001)","v":3},0.75,{"$f":"10/IF(H7>0,(K7/'Summary Stats'!$B$4)^3*(L7/'Summary Stats'!$B$3)^3*MAX((O7-$R$1+1)^2,0.001)*3^B7*IF(LEN(P7)=0,1,IF(P7>=$R$1,P7-$R$1+1,1/($R$1+1-P7))^2),1000000000)","v":2.4751932964980502E-3},92,{"$f":"IF(H7>0,SUMIF(Purchases!$U$3:$U$2002,A7,Purchases!$N$3:$N$2002)/H7,\"\")","v":59.523628030300138},58.32,null,2022,null,887.66666666666663,0.11941419451746152,0.41119038678182501,0.41119038678182501,0.41119038678182501,0.41119038678182501,0.41119038678182501,0.41119038678182501,0.41119038678182501,"","","","","","","","","","","","","","","","",178.57088409090042,174.96,"Red",null,null,null,null,null,null,"K Vintners",92,"Rater 1",null,null,null,null,"US|","US||",null,"Shiraz/Syrah",null,false]
["La Serena | 2001 | Brunello (Sangiovese) | Brunello di Montalcino | 0.75 L",2,"N","IT",2001,5068.6433027777748,{"$f":"SUMIF(Purchases!$U$3:$U$2002,A8,Purchases!$K$3:$K$2002)+SUMIF('Fully Consumed'!$U$2:$U$2001,A8,'Fully Consumed'!$K$2:$K$2001)","v":12},{"$f":"SUMIF(Purchases!$U$3:$U$2002,A8,Purchases!$M$3:$M$2001)","v":1},8.3333333333333329E-2,{"$f":"10/IF(H8>0,(K8/'Summary Stats'!$B$4)^3*(L8/'Summary Stats'!$B$3)^3*MAX((O8-$R$1+1)^2,0.001)*3^B8*IF(LEN(P8)=0,1,IF(P8>=$R$1,P8-$R$1+1,1/($R$1+1-P8))^2),1000000000)","v":63.814534745237395},96,{"$f":"IF(H8>0,SUMIF(Purchases!$U$3:$U$2002,A8,Purchases!$N$3:$N$2002)/H8,\"\")","v":53.553607642650604},52.5,null,2014,null,-259,1,"","","","","","","","","","","","","","","","","","","","","","","",53.553607642650604,52.5,"Red",null,null,null,null,null,null,"2001 Brunello",96,"Rater 2",null,null,null,null,"IT|","IT||",null,"Brunello",null,true]
["Shingleback | 2004 | Shiraz | McLaren Vale | 0.75 L",1,"S","AU",2004,4155.6433027777748,{"$f":"SUMIF(Purchases!$U$3:$U$2002,A9,Purchases!$K$3:$K$2002)+SUMIF('Fully Consumed'!$U$2:$U$2001,A9,'Fully Consumed'!$K$2:$K$2001)","v":24},{"$f":"SUMIF(Purchases!$U$3:$U$2002,A9,Purchases!$M$3:$M$2001)","v":2},8.3333333333333329E-2,{"$f":"10/IF(H9>0,(K9/'Summary Stats'!$B$4)^3*(L9/'Summary Stats'!$B$3)^3*MAX((O9-$R$1+1)^2,0.001)*3^B9*IF(LEN(P9)=0,1,IF(P9>=$R$1,P9-$R$1+1,1/($R$1+1-P9))^2),1000000000)","v":5656.1381485308948},91,{"$f":"IF(H9>0,SUMIF(Purchases!$U$3:$U$2002,A9,Purchases!$N$3:$N$2002)/H9,\"\")","v":18.275061944067481},17.940000000000001,null,2014,null,-129.5,2,"","","","","","","","","","","","","","","","","","","","","","","",36.550123888134962,35.880000000000003,"Red",null,null,null,null,null,null,null,91,"Rater 2",null,null,null,null,"AU|","AU||",null,"Shiraz/Syrah",null,true]
["Vignerons de Caractere | 2009 | Grenache (50), Syrah (40), Mouvedre (10) | Vacqueyras Cuvée Prestige | 0.75 L",1,"N","FR",2009,2146.6433027777748,{"$f":"SUMIF(Purchases!$U$3:$U$2002,A10,Purchases!$K$3:$K$2002)+SUMIF('Fully Consumed'!$U$2:$U$2001,A10,'Fully Consumed'!$K$2:$K$2001)","v":12},{"$f":"SUMIF(Purchases!$U$3:$U$2002,A10,Purchases!$M$3:$M$2001)","v":2},0.16666666666666666,{"$f":"10/IF(H10>0,(K10/'Summary Stats'!$B$4)^3*(L10/'Summary Stats'!$B$3)^3*MAX((O10-$R$1+1)^2,0.001)*3^B10*IF(LEN(P10)=0,1,IF(P10>=$R$1,P10-$R$1+1,1/($R$1+1-P10))^2),1000000000)","v":15283.044595973086},91,{"$f":"IF(H10>0,SUMIF(Purchases!$U$3:$U$2002,A10,Purchases!$N$3:$N$2002)/H10,\"\")","v":13.12085794866085},13.99,null,2014,null,-129.5,2,"","","","","","","","","","","","","","","","","","","","","","","",26.241715897321701,27.98,"Red",null,null,null,null,null,null,null,91,"Rater 2",null,null,null,null,"FR|","FR||",null,"Grenache Blend",null,true]
["No Girls Wines | 2009 | Syrah | La Paciencia Vineyard | 0.75 L",2,"N","US",2009,2146.6433027777748,{"$f":"SUMIF(Purchases!$U$3:$U$2002,A11,Purchases!$K$3:$K$2002)+SUMIF('Fully Consumed'!$U$2:$U$2001,A11,'Fully Consumed'!$K$2:$K$2001)","v":3},{"$f":"SUMIF(Purchases!$U$3:$U$2002,A11,Purchases!$M$3:$M$2001)","v":2},0.66666666666666663,{"$f":"10/IF(H11>0,(K11/'Summary Stats'!$B$4)^3*(L11/'Summary Stats'!$B$3)^3*MAX((O11-$R$1+1)^2,0.001)*3^B11*IF(LEN(P11)=0,1,IF(P11>=$R$1,P11-$R$1+1,1/($R$1+1-P11))^2),1000000000)","v":2.1029461611920359E-4},98,{"$f":"IF(H11>0,SUMIF(Purchases!$U$3:$U$2002,A11,Purchases!$N$3:$N$2002)/H11,\"\")","v":71.274785234212871},70.92,null,2025,null,1879.5,5.6397978185687682E-2,0.19420058526203779,0.19420058526203779,0.19420058526203779,0.19420058526203779,0.19420058526203779,0.19420058526203779,0.19420058526203779,0.19420058526203779,0.19420058526203779,0.19420058526203779,"","","","","","","","","","","","","",142.54957046842574,141.84,"Red",null,null,null,null,null,null,"The Rocks of Milton-Freewater",98,"Rater 2",null,null,null,null,"US|","US||",null,"Shiraz/Syrah","No Girls",false]
["K Vintners | 2013 | Grenache | The Boy Grenache | 0.75 L",1,"N","US",2013,685.64330277777481,{"$f":"SUMIF(Purchases!$U$3:$U$2002,A12,Purchases!$K$3:$K$2002)+SUMIF('Fully Consumed'!$U$2:$U$2001,A12,'Fully Consumed'!$K$2:$K$2001)","v":4},{"$f":"SUMIF(Purchases!$U$3:$U$2002,A12,Purchases!$M$3:$M$2001)","v":3},0.75,{"$f":"10/IF(H12>0,(K12/'Summary Stats'!$B$4)^3*(L12/'Summary Stats'!$B$3)^3*MAX((O12-$R$1+1)^2,0.001)*3^B12*IF(LEN(P12)=0,1,IF(P12>=$R$1,P12-$R$1+1,1/($R$1+1-P12))^2),1000000000)","v":1.0258473629647883E-2},91,{"$f":"IF(H12>0,SUMIF(Purchases!$U$3:$U$2002,A12,Purchases!$N$3:$N$2002)/H12,\"\")","v":51.249693857252595},50.22,null,2019,null,522.33333333333337,0.20293554562858965,0.69878749202297374,0.69878749202297374,0.69878749202297374,0.69878749202297374,"","","","","","","","","","","","","","","","","","","",153.74908157175778,150.66,"Red","Washington State",null,null,null,null,null,"K Vintners",91,"Rater 1",null,null,null,null,"US|Washington State","US|Washington State|",null,"Grenache",null,false]
["Terrabianca | 2007 | Sangiovese & Cab S | Toscana Campaccio | 0.75 L",1,"N","IT",2007,2877.6433027777748,{"$f":"SUMIF(Purchases!$U$3:$U$2002,A13,Purchases!$K$3:$K$2002)+SUMIF('Fully Consumed'!$U$2:$U$2001,A13,'Fully Consumed'!$K$2:$K$2001)","v":12},{"$f":"SUMIF(Purchases!$U$3:$U$2002,A13,Purchases!$M$3:$M$2001)","v":2},0.16666666666666666,{"$f":"10/IF(H13>0,(K13/'Summary Stats'!$B$4)^3*(L13/'Summary Stats'!$B$3)^3*MAX((O13-$R$1+1)^2,0.001)*3^B13*IF(LEN(P13)=0,1,IF(P13>=$R$1,P13-$R$1+1,1/($R$1+1-P13))^2),1000000000)","v":0.44682750409490124},93,{"$f":"IF(H13>0,SUMIF(Purchases!$U$3:$U$2002,A13,Purchases!$N$3:$N$2002)/H13,\"\")","v":20.035330080598591},21.99,null,2017,null,418.5,0.25328554360812428,0.87216248506571092,0.87216248506571092,"","","","","","","","","","","","","","","","","","","","","",40.070660161197182,43.98,"Red",null,null,null,null,"36-11",null,null,93,"Rater 2",null,null,null,null,"IT|","IT||",null,"Sangiovese Blend",null,false]
["Le Vieux Donjon | 2005 | Chateauneuf Du Pape | Chateauneuf Du Pape | 0.75 L",1,"N","FR",2005,3607.6433027777748,{"$f":"SUMIF(Purchases!$U$3:$U$2002,A14,Purchases!$K$3:$K$2002)+SUMIF('Fully Consumed'!$U$2:$U$2001,A14,'Fully Consumed'!$K$2:$K$2001)","v":6},{"$f":"SUMIF(Purchases!$U$3:$U$2002,A14,Purchases!$M$3:$M$2001)","v":5},0.83333333333333337,{"$f":"10/IF(H14>0,(K14/'Summary Stats'!$B$4)^3*(L14/'Summary Stats'!$B$3)^3*MAX((O14-$R$1+1)^2,0.001)*3^B14*IF(LEN(P14)=0,1,IF(P14>=$R$1,P14-$R$1+1,1/($R$1+1-P14))^2),1000000000)","v":2.8107925343665891E-3},95,{"$f":"IF(H14>0,SUMIF(Purchases!$U$3:$U$2002,A14,Purchases!$N$3:$N$2002)/H14,\"\")","v":44.68330212628841},42.66,null,2025,null,751.8,0.14099494546421923,0.48550146315509446,0.48550146315509446,0.48550146315509446,0.48550146315509446,0.48550146315509446,0.48550146315509446,0.48550146315509446,0.48550146315509446,0.48550146315509446,0.48550146315509446,"","","","","","","","","","","","","",223.41651063144207,213.29999999999998,"Red",null,null,null,null,40244,null,"2005 Châteauneuf-du-Pape",95,"Rater 2",null,null,null,null,"FR|","FR||",null,"Grenache Blend",null,false]
["Ravines | 2012 | Riesling | Riesling Finger Lakes Dry | 0.75 L",1,"N","US",2012,1050.6433027777748,{"$f":"SUMIF(Purchases!$U$3:$U$2002,A15,Purchases!$K$3:$K$2002)+SUMIF('Fully Consumed'!$U$2:$U$2001,A15,'Fully Consumed'!$K$2:$K$2001)","v":12},{"$f":"SUMIF(Purchases!$U$3:$U$2002,A15,Purchases!$M$3:$M$2001)","v":5},0.41666666666666669,{"$f":"10/IF(H15>0,(K15/'Summary Stats'!$B$4)^3*(L15/'Summary Stats'!$B$3)^3*MAX((O15-$R$1+1)^2,0.001)*3^B15*IF(LEN(P15)=0,1,IF(P15>=$R$1,P15-$R$1+1,1/($R$1+1-P15))^2),1000000000)","v":8.650305728532917},91,{"$f":"IF(H15>0,SUMIF(Purchases!$U$3:$U$2002,A15,Purchases!$N$3:$N$2002)/H15,\"\")","v":15.861893932908774},15.23,null,2015,null,21.2,5,"","","","","","","","","","","","","","","","","","","","","","","",79.309469664543869,76.150000000000006,"White",null,null,null,null,null,null,null,91,"Rater 2",null,null,null,null,"US|","US||",null,"Riesling",null,false]
["Horsepower Vineyards | 2012 | Syrah | Sur Echalas Vineyard Syrah | 0.75 L",1,"N","US",2012,1050.6433027777748,{"$f":"SUMIF(Purchases!$U$3:$U$2002,A16,Purchases!$K$3:$K$2002)+SUMIF('Fully Consumed'!$U$2:$U$2001,A16,'Fully Consumed'!$K$2:$K$2001)","v":3},{"$f":"SUMIF(Purchases!$U$3:$U$2002,A16,Purchases!$M$3:$M$2001)","v":3},1,{"$f":"10/IF(H16>0,(K16/'Summary Stats'!$B$4)^3*(L16/'Summary Stats'!$B$3)^3*MAX((O16-$R$1+1)^2,0.001)*3^B16*IF(LEN(P16)=0,1,IF(P16>=$R$1,P16-$R$1+1,1/($R$1+1-P16))^2),1000000000)","v":1.4598232068860708E-4},93,{"$f":"IF(H16>0,SUMIF(Purchases!$U$3:$U$2002,A16,Purchases!$N$3:$N$2002)/H16,\"\")","v":151.27386105179787},144.72,null,2022,null,887.66666666666663,0.11941419451746152,0.41119038678182501,0.41119038678182501,0.41119038678182501,0.41119038678182501,0.41119038678182501,0.41119038678182501,0.41119038678182501,"","","","","","","","","","","","","","","","",453.82158315539357,434.15999999999997,"Red","Walla Walla Valley","The Rocks of Milton-Freewater",null,null,null,null,"The Rocks of Milton-Freewater",93,"Rater 2",null,null,null,null,"US|Walla Walla Valley","US|Walla Walla Valley|The Rocks of Milton-Freewater",null,"Shiraz/Syrah",null,false]
["K Vintners | 2012 | Syrah | River Rock Syrah | 0.75 L",1,"N","US",2012,1050.6433027777748,{"$f":"SUMIF(Purchases!$U$3:$U$2002,A17,Purchases!$K$3:$K$2002)+SUMIF('Fully Consumed'!$U$2:$U$2001,A17,'Fully Consumed'!$K$2:$K$2001)","v":4},{"$f":"SUMIF(Purchases!$U$3:$U$2002,A17,Purchases!$M$3:$M$2001)","v":3},0.75,{"$f":"10/IF(H17>0,(K17/'Summary Stats'!$B$4)^3*(L17/'Summary Stats'!$B$3)^3*MAX((O17-$R$1+1)^2,0.001)*3^B17*IF(LEN(P17)=0,1,IF(P17>=$R$1,P17-$R$1+1,1/($R$1+1-P17))^2),1000000000)","v":4.9465661553562386E-3},92,{"$f":"IF(H17>0,SUMIF(Purchases!$U$3:$U$2002,A17,Purchases!$N$3:$N$2002)/H17,\"\")","v":47.256094561189421},45.63,null,2022,null,887.66666666666663,0.11941419451746152,0.41119038678182501,0.41119038678182501,0.41119038678182501,0.41119038678182501,0.41119038678182501,0.41119038678182501,0.41119038678182501,"","","","","","","","","","","","","","","","",141.76828368356826,136.89000000000001,"Red","Walla Walla Valley",null,null,null,null,null,"The Rocks of Milton-Freewater",92,"Rater 1",null,null,null,null,"US|Walla Walla Valley","US|Walla Walla Valley|",null,"Shiraz/Syrah","K Vintners",false]
["Quinta do Vale Meao | 2004 | Touriga Nacionale, Touriga Franca, Toriga Roriz, Tinta Barroca | Douro | 0.75 L",1,"N","PT",2004,3972.6433027777748,{"$f":"SUMIF(Purchases!$U$3:$U$2002,A18,Purchases!$K$3:$K$2002)+SUMIF('Fully Consumed'!$U$2:$U$2001,A18,'Fully Consumed'!$K$2:$K$2001)","v":6},{"$f":"SUMIF(Purchases!$U$3:$U$2002,A18,Purchases!$M$3:$M$2001)","v":4},0.66666666666666663,{"$f":"10/IF(H18>0,(K18/'Summary Stats'!$B$4)^3*(L18/'Summary Stats'!$B$3)^3*MAX((O18-$R$1+1)^2,0.001)*3^B18*IF(LEN(P18)=0,1,IF(P18>=$R$1,P18-$R$1+1,1/($R$1+1-P18))^2),1000000000)","v":0.17173438027888493},97,{"$f":"IF(H18>0,SUMIF(Purchases!$U$3:$U$2002,A18,Purchases!$N$3:$N$2002)/H18,\"\")","v":54.956125013351439},52.78,null,2015,null,26.5,4,{"$f":"IF(ISNUMBER($Q18),IF(AND(S$1<=$O18,S$1>=$P18),365/$Q18,\"\"),\"\")","v":""},"","","","","","","","","",{"$f":"IF(ISNUMBER($Q18),IF(AND(AC$1<=$O18,AC$1>=$P18),365/$Q18,\"\"),\"\")","v":""},"","","","","","","","","","","","",219.82450005340576,211.12,"Red",null,null,null,null,"18-06",null,null,97,"Rater 2",null,null,null,null,"PT|","PT||",null,"Touriga Blend",null,false]
["Domaine de Beaurenard | 2010 | Grenache blend | Châteauneuf-du-Pape Boisrenard | 0.75 L",1,"N","FR",2010,1781.6433027777748,{"$f":"SUMIF(Purchases!$U$3:$U$2002,A19,Purchases!$K$3:$K$2002)+SUMIF('Fully Consumed'!$U$2:$U$2001,A19,'Fully Consumed'!$K$2:$K$2001)","v":12},{"$f":"SUMIF(Purchases!$U$3:$U$2002,A19,Purchases!$M$3:$M$2001)","v":11},0.91666666666666663,{"$f":"10/IF(H19>0,(K19/'Summary Stats'!$B$4)^3*(L19/'Summary Stats'!$B$3)^3*MAX((O19-$R$1+1)^2,0.001)*3^B19*IF(LEN(P19)=0,1,IF(P19>=$R$1,P19-$R$1+1,1/($R$1+1-P19))^2),1000000000)","v":4.4909329124283813E-4},97,{"$f":"IF(H19>0,SUMIF(Purchases!$U$3:$U$2002,A19,Purchases!$N$3:$N$2002)/H19,\"\")","v":62.8216985168159},60.07,null,2030,null,507.72727272727275,0.20877350044762757,0.71888988361683082,0.71888988361683082,0.71888988361683082,0.71888988361683082,0.71888988361683082,0.71888988361683082,0.71888988361683082,0.71888988361683082,0.71888988361683082,0.71888988361683082,0.71888988361683082,0.71888988361683082,0.71888988361683082,0.71888988361683082,0.71888988361683082,"","","","","","","","",691.0386836849749,660.77,"Red",null,null,null,null,null,null,null,97,"Rater 2",null,null,null,null,"FR|","FR||",null,"Grenache Blend",null,false]
["No Girls Wines | 2011 | Grenache | La Paciencia Vineyard | 0.75 L",2,"N","US",2011,1416.6433027777748,{"$f":"SUMIF(Purchases!$U$3:$U$2002,A20,Purchases!$K$3:$K$2002)+SUMIF('Fully Consumed'!$U$2:$U$2001,A20,'Fully Consumed'!$K$2:$K$2001)","v":3},{"$f":"SUMIF(Purchases!$U$3:$U$2002,A20,Purchases!$M$3:$M$2001)","v":3},1,{"$f":"10/IF(H20>0,(K20/'Summary Stats'!$B$4)^3*(L20/'Summary Stats'!$B$3)^3*MAX((O20-$R$1+1)^2,0.001)*3^B20*IF(LEN(P20)=0,1,IF(P20>=$R$1,P20-$R$1+1,1/($R$1+1-P20))^2),1000000000)","v":3.3195434725953154E-4},93,{"$f":"IF(H20>0,SUMIF(Purchases!$U$3:$U$2002,A20,Purchases!$N$3:$N$2002)/H20,\"\")","v":87.188406260490424},87.12,null,2021,null,766,0.13838120104438642,0.47650130548302871,0.47650130548302871,0.47650130548302871,0.47650130548302871,0.47650130548302871,0.47650130548302871,"","","","","","","","","","","","","","","","","",261.56521878147129,261.36,"Red","Walla Walla Valley","The Rocks of Milton-Freewater",null,null,null,null,"The Rocks of Milton-Freewater",92,"Rater 2",null,null,null,null,"US|Walla Walla Valley","US|Walla Walla Valley|The Rocks of Milton-Freewater",null,"Grenache","No Girls",false]
["Schild | 2007 | Shiraz | Barossa | 0.75 L",5,"S","AU",2007,3060.6433027777748,{"$f":"SUMIF(Purchases!$U$3:$U$2002,A21,Purchases!$K$3:$K$2002)+SUMIF('Fully Consumed'!$U$2:$U$2001,A21,'Fully Consumed'!$K$2:$K$2001)","v":12},{"$f":"SUMIF(Purchases!$U$3:$U$2002,A21,Purchases!$M$3:$M$2001)","v":12},1,{"$f":"10/IF(H21>0,(K21/'Summary Stats'!$B$4)^3*(L21/'Summary Stats'!$B$3)^3*MAX((O21-$R$1+1)^2,0.001)*3^B21*IF(LEN(P21)=0,1,IF(P21>=$R$1,P21-$R$1+1,1/($R$1+1-P21))^2),1000000000)","v":7.380602772168939E-3},92,{"$f":"IF(H21>0,SUMIF(Purchases!$U$3:$U$2002,A21,Purchases!$N$3:$N$2002)/H21,\"\")","v":18.380019677907228},17.98,null,2017,null,69.75,1.5197132616487454,5.2329749103942653,5.2329749103942653,"","","","","","","","","","","","","","","","","","","","","",220.56023613488674,215.76,"Red",null,null,null,null,null,null,null,92,"Rater 2",null,null,null,null,"AU|","AU||",null,"Shiraz/Syrah",null,false]
["Thorn Clarke | 2005 | Shiraz | Barossa Shotfire Ridge | 0.75 L",1,"S","AU",2005,3790.6433027777748,{"$f":"SUMIF(Purchases!$U$3:$U$2002,A22,Purchases!$K$3:$K$2002)+SUMIF('Fully Consumed'!$U$2:$U$2001,A22,'Fully Consumed'!$K$2:$K$2001)","v":24},{"$f":"SUMIF(Purchases!$U$3:$U$2002,A22,Purchases!$M$3:$M$2001)","v":2},8.3333333333333329E-2,{"$f":"10/IF(H22>0,(K22/'Summary Stats'!$B$4)^3*(L22/'Summary Stats'!$B$3)^3*MAX((O22-$R$1+1)^2,0.001)*3^B22*IF(LEN(P22)=0,1,IF(P22>=$R$1,P22-$R$1+1,1/($R$1+1-P22))^2),1000000000)","v":8.1945441614091745},92,{"$f":"IF(H22>0,SUMIF(Purchases!$U$3:$U$2002,A22,Purchases!$N$3:$N$2002)/H22,\"\")","v":15.975121090561151},15.35,null,2015,null,53,2,"","","","","","","","","","","","","","","","","","","","","","","",31.950242181122302,30.7,"Red",null,null,null,null,null,null,null,92,"Rater 2",null,null,null,null,"AU|","AU||",null,"Shiraz/Syrah",null,false]
["Domaine des Baumard | 2005 | Chenin Blanc | Coteaux du Layon Carte d'Or | 0.75 L",1,"N","FR",2005,3607.6433027777748,{"$f":"SUMIF(Purchases!$U$3:$U$2002,A23,Purchases!$K$3:$K$2002)+SUMIF('Fully Consumed'!$U$2:$U$2001,A23,'Fully Consumed'!$K$2:$K$2001)","v":12},{"$f":"SUMIF(Purchases!$U$3:$U$2002,A23,Purchases!$M$3:$M$2001)","v":2},0.16666666666666666,{"$f":"10/IF(H23>0,(K23/'Summary Stats'!$B$4)^3*(L23/'Summary Stats'!$B$3)^3*MAX((O23-$R$1+1)^2,0.001)*3^B23*IF(LEN(P23)=0,1,IF(P23>=$R$1,P23-$R$1+1,1/($R$1+1-P23))^2),1000000000)","v":0.48926638214133095},92,{"$f":"IF(H23>0,SUMIF(Purchases!$U$3:$U$2002,A23,Purchases!$N$3:$N$2002)/H23,\"\")","v":19.64972440522909},19.13,null,2017,null,418.5,0.25328554360812428,0.87216248506571092,0.87216248506571092,"","","","","","","","","","","","","","","","","","","","","",39.299448810458181,38.26,"White",null,null,null,null,null,null,null,92,"Rater 2",null,null,null,null,"FR|","FR||",null,"Chenin Blanc",null,false]
["Giovanni Corino | 2007 | Nebbiolo | Barolo | 0.75 L",1,"N","IT",2007,2877.6433027777748,{"$f":"SUMIF(Purchases!$U$3:$U$2002,A24,Purchases!$K$3:$K$2002)+SUMIF('Fully Consumed'!$U$2:$U$2001,A24,'Fully Consumed'!$K$2:$K$2001)","v":12},{"$f":"SUMIF(Purchases!$U$3:$U$2002,A24,Purchases!$M$3:$M$2001)","v":11},0.91666666666666663,{"$f":"10/IF(H24>0,(K24/'Summary Stats'!$B$4)^3*(L24/'Summary Stats'!$B$3)^3*MAX((O24-$R$1+1)^2,0.001)*3^B24*IF(LEN(P24)=0,1,IF(P24>=$R$1,P24-$R$1+1,1/($R$1+1-P24))^2),1000000000)","v":1.8901570073448046E-3},95,{"$f":"IF(H24>0,SUMIF(Purchases!$U$3:$U$2002,A24,Purchases!$N$3:$N$2002)/H24,\"\")","v":39.728670530021191},38.99,null,2030,null,507.72727272727275,0.20877350044762757,0.71888988361683082,0.71888988361683082,0.71888988361683082,0.71888988361683082,0.71888988361683082,0.71888988361683082,0.71888988361683082,0.71888988361683082,0.71888988361683082,0.71888988361683082,0.71888988361683082,0.71888988361683082,0.71888988361683082,0.71888988361683082,0.71888988361683082,"","","","","","","","",437.0153758302331,428.89000000000004,"Red",null,null,null,null,null,null,null,95,"Rater 2",null,null,null,null,"IT|","IT||",null,"Nebbiolo",null,false]
["K Vintners | 2007 | Syrah | Syrah Wahluke Slope Northridge | 0.75 L",1,"N","US",2007,2877.6433027777748,{"$f":"SUMIF(Purchases!$U$3:$U$2002,A25,Purchases!$K$3:$K$2002)+SUMIF('Fully Consumed'!$U$2:$U$2001,A25,'Fully Consumed'!$K$2:$K$2001)","v":3},{"$f":"SUMIF(Purchases!$U$3:$U$2002,A25,Purchases!$M$3:$M$2001)","v":2},0.66666666666666663,{"$f":"10/IF(H25>0,(K25/'Summary Stats'!$B$4)^3*(L25/'Summary Stats'!$B$3)^3*MAX((O25-$R$1+1)^2,0.001)*3^B25*IF(LEN(P25)=0,1,IF(P25>=$R$1,P25-$R$1+1,1/($R$1+1-P25))^2),1000000000)","v":1.3318557423882809E-2},96,{"$f":"IF(H25>0,SUMIF(Purchases!$U$3:$U$2002,A25,Purchases!$N$3:$N$2002)/H25,\"\")","v":39.435055555522446},39.03,null,2020,null,966.5,0.10967408173823073,0.3776513191929643,0.3776513191929643,0.3776513191929643,0.3776513191929643,0.3776513191929643,"","","","","","","","","","","","","","","","","","",78.870111111044892,78.06,"Red",null,null,null,null,null,null,"K Vintners",96,"Rater 2",null,null,null,null,"US|","US||",null,"Shiraz/Syrah",null,false]
["Reynvaan Family Vineyards | 2012 | Syrah | The Contender | 0.75 L",1,"N","US",2012,1050.6433027777748,{"$f":"SUMIF(Purchases!$U$3:$U$2002,A26,Purchases!$K$3:$K$2002)+SUMIF('Fully Consumed'!$U$2:$U$2001,A26,'Fully Consumed'!$K$2:$K$2001)","v":3},{"$f":"SUMIF(Purchases!$U$3:$U$2002,A26,Purchases!$M$3:$M$2001)","v":2},0.66666666666666663,{"$f":"10/IF(H26>0,(K26/'Summary Stats'!$B$4)^3*(L26/'Summary Stats'!$B$3)^3*MAX((O26-$R$1+1)^2,0.001)*3^B26*IF(LEN(P26)=0,1,IF(P26>=$R$1,P26-$R$1+1,1/($R$1+1-P26))^2),1000000000)","v":7.8635714378831145E-4},94,{"$f":"IF(H26>0,SUMIF(Purchases!$U$3:$U$2002,A26,Purchases!$N$3:$N$2002)/H26,\"\")","v":85.377964328527455},82.8,null,2022,null,1331.5,7.9609463011641013E-2,0.27412692452121667,0.27412692452121667,0.27412692452121667,0.27412692452121667,0.27412692452121667,0.27412692452121667,0.27412692452121667,"","","","","","","","","","","","","","","","",170.75592865705491,165.6,"Red","Walla Walla Valley","The Rocks of Milton-Freewater",null,null,null,null,"Reynvaan",94,"Rater 2",null,null,null,null,"US|Walla Walla Valley","US|Walla Walla Valley|The Rocks of Milton-Freewater",null,"Shiraz/Syrah",null,false]
["Schild | 2009 | Shiraz | Barossa | 0.75 L",5,"S","AU",2009,2329.6433027777748,{"$f":"SUMIF(Purchases!$U$3:$U$2002,A27,Purchases!$K$3:$K$2002)+SUMIF('Fully Consumed'!$U$2:$U$2001,A27,'Fully Consumed'!$K$2:$K$2001)","v":24},{"$f":"SUMIF(Purchases!$U$3:$U$2002,A27,Purchases!$M$3:$M$2001)","v":22},0.91666666666666663,{"$f":"10/IF(H27>0,(K27/'Summary Stats'!$B$4)^3*(L27/'Summary Stats'!$B$3)^3*MAX((O27-$R$1+1)^2,0.001)*3^B27*IF(LEN(P27)=0,1,IF(P27>=$R$1,P27-$R$1+1,1/($R$1+1-P27))^2),1000000000)","v":3.0166140667863455E-3},92,{"$f":"IF(H27>0,SUMIF(Purchases!$U$3:$U$2002,A27,Purchases!$N$3:$N$2002)/H27,\"\")","v":17.618577141582968},16.82,null,2019,null,71.227272727272734,1.488194001276324,{"$f":"IF(ISNUMBER($Q27),IF(AND(S$1<=$O27,S$1>=$P27),365/$Q27,\"\"),\"\")","v":5.1244416081684747},5.1244416081684747,5.1244416081684747,5.1244416081684747,"","","","","","",{"$f":"IF(ISNUMBER($Q27),IF(AND(AC$1<=$O27,AC$1>=$P27),365/$Q27,\"\"),\"\")","v":""},"","","","","","","","","","","","",387.6086971148253,370.04,"Red",null,null,null,null,null,null,null,92,"Rater 2",null,null,null,null,"AU|","AU||",null,"Shiraz/Syrah",null,false]
["Bodegas Marques de Carrion | 2009 | Tempranillo Blend | Rioja Antaño Reserva | 0.75 L",1,"N","ES",2009,2146.6433027777748,{"$f":"SUMIF(Purchases!$U$3:$U$2002,A28,Purchases!$K$3:$K$2002)+SUMIF('Fully Consumed'!$U$2:$U$2001,A28,'Fully Consumed'!$K$2:$K$2001)","v":12},{"$f":"SUMIF(Purchases!$U$3:$U$2002,A28,Purchases!$M$3:$M$2001)","v":12},1,{"$f":"10/IF(H28>0,(K28/'Summary Stats'!$B$4)^3*(L28/'Summary Stats'!$B$3)^3*MAX((O28-$R$1+1)^2,0.001)*3^B28*IF(LEN(P28)=0,1,IF(P28>=$R$1,P28-$R$1+1,1/($R$1+1-P28))^2),1000000000)","v":1.4613369197350925},91,{"$f":"IF(H28>0,SUMIF(Purchases!$U$3:$U$2002,A28,Purchases!$N$3:$N$2002)/H28,\"\")","v":9.8130061732232576},10.050000000000001,null,2019,null,130.58333333333334,0.81174218251435859,2.795149968091895,2.795149968091895,2.795149968091895,2.795149968091895,"","","","","","","","","","","","","","","","","","","",117.75607407867909,120.60000000000001,"Red",null,null,null,null,null,null,null,91,"Rater 2",null,null,null,null,"ES|","ES||",null,"Tempranillo Blend",null,false]
["Schild | 2008 | Shiraz | Barossa | 0.75 L",5,"S","AU",2008,2694.6433027777748,{"$f":"SUMIF(Purchases!$U$3:$U$2002,A29,Purchases!$K$3:$K$2002)+SUMIF('Fully Consumed'!$U$2:$U$2001,A29,'Fully Consumed'!$K$2:$K$2001)","v":24},{"$f":"SUMIF(Purchases!$U$3:$U$2002,A29,Purchases!$M$3:$M$2001)","v":24},1,{"$f":"10/IF(H29>0,(K29/'Summary Stats'!$B$4)^3*(L29/'Summary Stats'!$B$3)^3*MAX((O29-$R$1+1)^2,0.001)*3^B29*IF(LEN(P29)=0,1,IF(P29>=$R$1,P29-$R$1+1,1/($R$1+1-P29))^2),1000000000)","v":1.4905522763499499E-3},94,{"$f":"IF(H29>0,SUMIF(Purchases!$U$3:$U$2002,A29,Purchases!$N$3:$N$2002)/H29,\"\")","v":19.315271716713905},21.16,null,2020,null,80.541666666666671,1.3160889808587686,4.5318158303155718,4.5318158303155718,4.5318158303155718,4.5318158303155718,4.5318158303155718,"","","","","","","","","","","","","","","","","","",463.5665212011337,507.84000000000003,"Red",null,null,null,null,null,null,null,94,"Rater 2",null,null,null,null,"AU|","AU||",null,"Shiraz/Syrah",null,false]
["Vina Herminia | 2005 | Tempranillo | Rioja Reserva | 0.75 L",1,"N","ES",2005,3607.6433027777748,{"$f":"SUMIF(Purchases!$U$3:$U$2002,A30,Purchases!$K$3:$K$2002)+SUMIF('Fully Consumed'!$U$2:$U$2001,A30,'Fully Consumed'!$K$2:$K$2001)","v":12},{"$f":"SUMIF(Purchases!$U$3:$U$2002,A30,Purchases!$M$3:$M$2001)","v":12},1,{"$f":"10/IF(H30>0,(K30/'Summary Stats'!$B$4)^3*(L30/'Summary Stats'!$B$3)^3*MAX((O30-$R$1+1)^2,0.001)*3^B30*IF(LEN(P30)=0,1,IF(P30>=$R$1,P30-$R$1+1,1/($R$1+1-P30))^2),1000000000)","v":8.2614812611123939E-2},93,{"$f":"IF(H30>0,SUMIF(Purchases!$U$3:$U$2002,A30,Purchases!$N$3:$N$2002)/H30,\"\")","v":22.154935837388038},21.4,null,2020,null,161.08333333333334,0.65804449042938429,2.2659079151577859,2.2659079151577859,2.2659079151577859,2.2659079151577859,2.2659079151577859,"","","","","","","","","","","","","","","","","","",265.85923004865646,256.79999999999995,"Red",null,null,null,null,null,null,null,93,"Rater 2",null,null,null,null,"ES|","ES||",null,"Tempranillo Blend",null,false]
["Columbia Crest | 2004 | Cabernet Sauvignon | Columbia Valley Reserve | 0.75 L",1,"N","US",2004,3972.6433027777748,{"$f":"SUMIF(Purchases!$U$3:$U$2002,A31,Purchases!$K$3:$K$2002)+SUMIF('Fully Consumed'!$U$2:$U$2001,A31,'Fully Consumed'!$K$2:$K$2001)","v":12},{"$f":"SUMIF(Purchases!$U$3:$U$2002,A31,Purchases!$M$3:$M$2001)","v":5},0.41666666666666669,{"$f":"10/IF(H31>0,(K31/'Summary Stats'!$B$4)^3*(L31/'Summary Stats'!$B$3)^3*MAX((O31-$R$1+1)^2,0.001)*3^B31*IF(LEN(P31)=0,1,IF(P31>=$R$1,P31-$R$1+1,1/($R$1+1-P31))^2),1000000000)","v":0.33090059783779446},92,{"$f":"IF(H31>0,SUMIF(Purchases!$U$3:$U$2002,A31,Purchases!$N$3:$N$2002)/H31,\"\")","v":29.333681875824929},28.67,null,2016,null,94.4,1.1228813559322033,3.8665254237288131,"","","","","","","","","","","","","","","","","","","","","","",146.66840937912465,143.35000000000002,"Red",null,null,null,null,null,null,null,92,"Rater 2",null,null,null,null,"US|","US||",null,"Cab S",null,false]
["Punset | 2007 | Nebbiolo | Barbaresco  | 0.75 L",1,"N","IT",2007,2877.6433027777748,{"$f":"SUMIF(Purchases!$U$3:$U$2002,A32,Purchases!$K$3:$K$2002)+SUMIF('Fully Consumed'!$U$2:$U$2001,A32,'Fully Consumed'!$K$2:$K$2001)","v":12},{"$f":"SUMIF(Purchases!$U$3:$U$2002,A32,Purchases!$M$3:$M$2001)","v":11},0.91666666666666663,{"$f":"10/IF(H32>0,(K32/'Summary Stats'!$B$4)^3*(L32/'Summary Stats'!$B$3)^3*MAX((O32-$R$1+1)^2,0.001)*3^B32*IF(LEN(P32)=0,1,IF(P32>=$R$1,P32-$R$1+1,1/($R$1+1-P32))^2),1000000000)","v":2.9245607548294538E-3},95,{"$f":"IF(H32>0,SUMIF(Purchases!$U$3:$U$2002,A32,Purchases!$N$3:$N$2002)/H32,\"\")","v":39.448836318254472},38.32,null,2027,null,408.09090909090907,0.25974604588995326,0.89440855424370691,0.89440855424370691,0.89440855424370691,0.89440855424370691,0.89440855424370691,0.89440855424370691,0.89440855424370691,0.89440855424370691,0.89440855424370691,0.89440855424370691,0.89440855424370691,0.89440855424370691,"","","","","","","","","","","",433.93719950079918,421.52,"Red",null,null,null,null,null,null,null,95,"Rater 2",null,null,null,null,"IT|","IT||",null,"Nebbiolo",null,false]
["Palagetto | 2006 | Syrah | Syrah Toscana Uno di Quattro | 0.75 L",1,"N","IT",2006,3242.6433027777748,{"$f":"SUMIF(Purchases!$U$3:$U$2002,A33,Purchases!$K$3:$K$2002)+SUMIF('Fully Consumed'!$U$2:$U$2001,A33,'Fully Consumed'!$K$2:$K$2001)","v":12},{"$f":"SUMIF(Purchases!$U$3:$U$2002,A33,Purchases!$M$3:$M$2001)","v":7},0.58333333333333337,{"$f":"10/IF(H33>0,(K33/'Summary Stats'!$B$4)^3*(L33/'Summary Stats'!$B$3)^3*MAX((O33-$R$1+1)^2,0.001)*3^B33*IF(LEN(P33)=0,1,IF(P33>=$R$1,P33-$R$1+1,1/($R$1+1-P33))^2),1000000000)","v":1.123272881829787E-2},96,{"$f":"IF(H33>0,SUMIF(Purchases!$U$3:$U$2002,A33,Purchases!$N$3:$N$2002)/H33,\"\")","v":37.662450019061566},35.869999999999997,null,2021,null,328.28571428571428,0.32288946910356831,1.1118363794604005,1.1118363794604005,1.1118363794604005,1.1118363794604005,1.1118363794604005,1.1118363794604005,"","","","","","","","","","","","","","","","","",263.63715013343096,251.08999999999997,"Red",null,null,null,null,null,null,null,96,"Rater 2",null,null,null,null,"IT|","IT||",null,"Shiraz/Syrah",null,false]
["Phillipe Delesvaux | 2004 | Chenin Blanc | Coteaux du Layon Selection de Grains Nobles | 0.5 L",1,"N","FR",2004,3972.6433027777748,{"$f":"SUMIF(Purchases!$U$3:$U$2002,A34,Purchases!$K$3:$K$2002)+SUMIF('Fully Consumed'!$U$2:$U$2001,A34,'Fully Consumed'!$K$2:$K$2001)","v":6},{"$f":"SUMIF(Purchases!$U$3:$U$2002,A34,Purchases!$M$3:$M$2001)","v":3},0.5,{"$f":"10/IF(H34>0,(K34/'Summary Stats'!$B$4)^3*(L34/'Summary Stats'!$B$3)^3*MAX((O34-$R$1+1)^2,0.001)*3^B34*IF(LEN(P34)=0,1,IF(P34>=$R$1,P34-$R$1+1,1/($R$1+1-P34))^2),1000000000)","v":1.8059314670813977E-2},95,{"$f":"IF(H34>0,SUMIF(Purchases!$U$3:$U$2002,A34,Purchases!$N$3:$N$2002)/H34,\"\")","v":36.003831911474464},35.57,null,2020,null,644.33333333333337,0.16451112260734607,0.56647697878944647,0.56647697878944647,0.56647697878944647,0.56647697878944647,0.56647697878944647,"","","","","","","","","","","","","","","","","","",108.01149573442339,106.71000000000001,"White",null,null,null,null,null,null,null,95,"Rater 2",null,null,null,null,"FR|","FR||",null,"Chenin Blanc",null,false]
["Fox Gordon | 2004 | Shiraz | Eight Uncles Barossa Valley | 0.75 L",1,"S","AU",2004,4155.6433027777748,{"$f":"SUMIF(Purchases!$U$3:$U$2002,A35,Purchases!$K$3:$K$2002)+SUMIF('Fully Consumed'!$U$2:$U$2001,A35,'Fully Consumed'!$K$2:$K$2001)","v":12},{"$f":"SUMIF(Purchases!$U$3:$U$2002,A35,Purchases!$M$3:$M$2001)","v":2},0.16666666666666666,{"$f":"10/IF(H35>0,(K35/'Summary Stats'!$B$4)^3*(L35/'Summary Stats'!$B$3)^3*MAX((O35-$R$1+1)^2,0.001)*3^B35*IF(LEN(P35)=0,1,IF(P35>=$R$1,P35-$R$1+1,1/($R$1+1-P35))^2),1000000000)","v":0.15987209930514382},91,{"$f":"IF(H35>0,SUMIF(Purchases!$U$3:$U$2002,A35,Purchases!$N$3:$N$2002)/H35,\"\")","v":18.169395046323537},17.79,null,2020,null,966.5,0.10967408173823073,0.3776513191929643,0.3776513191929643,0.3776513191929643,0.3776513191929643,0.3776513191929643,"","","","","","","","","","","","","","","","","","",36.338790092647073,35.58,"Red",null,null,null,null,null,null,null,91,"Rater 2",null,null,null,null,"AU|","AU||",null,"Shiraz/Syrah",null,false]
["Torzi Matthews | 2007 | Syrah | Schist Rock Eden Valley | 0.75 L",1,"S","AU",2007,3060.6433027777748,{"$f":"SUMIF(Purchases!$U$3:$U$2002,A36,Purchases!$K$3:$K$2002)+SUMIF('Fully Consumed'!$U$2:$U$2001,A36,'Fully Consumed'!$K$2:$K$2001)","v":12},{"$f":"SUMIF(Purchases!$U$3:$U$2002,A36,Purchases!$M$3:$M$2001)","v":2},0.16666666666666666,{"$f":"10/IF(H36>0,(K36/'Summary Stats'!$B$4)^3*(L36/'Summary Stats'!$B$3)^3*MAX((O36-$R$1+1)^2,0.001)*3^B36*IF(LEN(P36)=0,1,IF(P36>=$R$1,P36-$R$1+1,1/($R$1+1-P36))^2),1000000000)","v":0.71915897776190629},92,{"$f":"IF(H36>0,SUMIF(Purchases!$U$3:$U$2002,A36,Purchases!$N$3:$N$2002)/H36,\"\")","v":17.28210423347354},17.52,null,2017,null,418.5,0.25328554360812428,0.87216248506571092,0.87216248506571092,"","","","","","","","","","","","","","","","","","","","","",34.564208466947079,35.04,"Red",null,null,null,null,null,null,null,92,"Rater 2",null,null,null,null,"AU|","AU||",null,"Shiraz/Syrah",null,false]
["Donatella Cinelli Colombini | 2010 | Sangiovese | Brunello di Montalcino Progetto Prime Donne | 0.75 L",1,"N","IT",2010,1781.6433027777748,{"$f":"SUMIF(Purchases!$U$3:$U$2002,A37,Purchases!$K$3:$K$2002)+SUMIF('Fully Consumed'!$U$2:$U$2001,A37,'Fully Consumed'!$K$2:$K$2001)","v":12},{"$f":"SUMIF(Purchases!$U$3:$U$2002,A37,Purchases!$M$3:$M$2001)","v":12},1,{"$f":"10/IF(H37>0,(K37/'Summary Stats'!$B$4)^3*(L37/'Summary Stats'!$B$3)^3*MAX((O37-$R$1+1)^2,0.001)*3^B37*IF(LEN(P37)=0,1,IF(P37>=$R$1,P37-$R$1+1,1/($R$1+1-P37))^2),1000000000)","v":1.8969100288851677E-5},96,{"$f":"IF(H37>0,SUMIF(Purchases!$U$3:$U$2002,A37,Purchases!$N$3:$N$2002)/H37,\"\")","v":51.998870421588414},50.58,null,2035,2019,517.33333333333337,"",{"$f":"IF(ISNUMBER($Q37),IF(AND(S$1<=$O37,S$1>=$P37),365/$Q37,\"\"),\"\")","v":""},"","",0.705541237113402,0.705541237113402,0.705541237113402,0.705541237113402,0.705541237113402,0.705541237113402,0.705541237113402,{"$f":"IF(ISNUMBER($Q37),IF(AND(AC$1<=$O37,AC$1>=$P37),365/$Q37,\"\"),\"\")","v":0.705541237113402},0.705541237113402,0.705541237113402,0.705541237113402,0.705541237113402,0.705541237113402,0.705541237113402,0.705541237113402,0.705541237113402,0.705541237113402,"","","",623.986445059061,606.96,"Red",null,null,null,null,null,null,"2010 Brunello",96,"Rater 2",null,null,null,null,"IT|","IT||",null,"Brunello",null,false]
["No Girls Wines | 2008 | Syrah | La Paciencia Vineyard | 0.75 L",2,"N","US",2008,2511.6433027777748,{"$f":"SUMIF(Purchases!$U$3:$U$2002,A38,Purchases!$K$3:$K$2002)+SUMIF('Fully Consumed'!$U$2:$U$2001,A38,'Fully Consumed'!$K$2:$K$2001)","v":3},{"$f":"SUMIF(Purchases!$U$3:$U$2002,A38,Purchases!$M$3:$M$2001)","v":2},0.66666666666666663,{"$f":"10/IF(H38>0,(K38/'Summary Stats'!$B$4)^3*(L38/'Summary Stats'!$B$3)^3*MAX((O38-$R$1+1)^2,0.001)*3^B38*IF(LEN(P38)=0,1,IF(P38>=$R$1,P38-$R$1+1,1/($R$1+1-P38))^2),1000000000)","v":3.6256314503293335E-3},96,{"$f":"IF(H38>0,SUMIF(Purchases!$U$3:$U$2002,A38,Purchases!$N$3:$N$2002)/H38,\"\")","v":55.283312246203423},55,null,2018,null,601,0.17637271214642264,0.60732113144758737,0.60732113144758737,0.60732113144758737,"","","","","","","","","","","","","","","","","","","","",110.56662449240685,110,"Red",null,null,null,null,null,null,"The Rocks of Milton-Freewater",96,"Rater 2",null,null,null,null,"US|","US||",null,"Shiraz/Syrah","No Girls",false]
["Konzelmann | 2008 | Riesling | Riesling Icewine | 0.375 L",1,"N","CA",2008,2511.6433027777748,{"$f":"SUMIF(Purchases!$U$3:$U$2002,A39,Purchases!$K$3:$K$2002)+SUMIF('Fully Consumed'!$U$2:$U$2001,A39,'Fully Consumed'!$K$2:$K$2001)","v":1},{"$f":"SUMIF(Purchases!$U$3:$U$2002,A39,Purchases!$M$3:$M$2001)","v":1},1,{"$f":"10/IF(H39>0,(K39/'Summary Stats'!$B$4)^3*(L39/'Summary Stats'!$B$3)^3*MAX((O39-$R$1+1)^2,0.001)*3^B39*IF(LEN(P39)=0,1,IF(P39>=$R$1,P39-$R$1+1,1/($R$1+1-P39))^2),1000000000)","v":0.27862448715167487},90,{"$f":"IF(H39>0,SUMIF(Purchases!$U$3:$U$2002,A39,Purchases!$N$3:$N$2002)/H39,\"\")","v":50.407053977251053},50,null,2015,null,106,1,"","","","","","","","","","","","","","","","","","","","","","","",50.407053977251053,50,"Dessert",null,null,null,null,null,null,null,90,"Rater 2",null,null,null,null,"CA|","CA||",null,"Riesling",null,false]
["Domaine des Baumard | 2005 | Chenin Blanc | Quarts de Chaume | 0.75 L",1,"N","FR",2005,3607.6433027777748,{"$f":"SUMIF(Purchases!$U$3:$U$2002,A40,Purchases!$K$3:$K$2002)+SUMIF('Fully Consumed'!$U$2:$U$2001,A40,'Fully Consumed'!$K$2:$K$2001)","v":5},{"$f":"SUMIF(Purchases!$U$3:$U$2002,A40,Purchases!$M$3:$M$2001)","v":5},1,{"$f":"10/IF(H40>0,(K40/'Summary Stats'!$B$4)^3*(L40/'Summary Stats'!$B$3)^3*MAX((O40-$R$1+1)^2,0.001)*3^B40*IF(LEN(P40)=0,1,IF(P40>=$R$1,P40-$R$1+1,1/($R$1+1-P40))^2),1000000000)","v":4.280896207129842E-4},98,{"$f":"IF(H40>0,SUMIF(Purchases!$U$3:$U$2002,A40,Purchases!$N$3:$N$2002)/H40,\"\")","v":63.181406445056197},66.3,null,2030,null,1117,9.4897045658012533E-2,0.32676812891674129,0.32676812891674129,0.32676812891674129,0.32676812891674129,0.32676812891674129,0.32676812891674129,0.32676812891674129,0.32676812891674129,0.32676812891674129,0.32676812891674129,0.32676812891674129,0.32676812891674129,0.32676812891674129,0.32676812891674129,0.32676812891674129,"","","","","","","","",315.907032225281,331.5,"White",null,null,null,null,null,null,null,98,"Rater 2",null,null,null,null,"FR|","FR||",null,"Chenin Blanc",null,false]
["Peter Lehmann | 2005 | Shiraz | Shiraz Barossa | 0.75 L",1,"S","AU",2005,3790.6433027777748,{"$f":"SUMIF(Purchases!$U$3:$U$2002,A41,Purchases!$K$3:$K$2002)+SUMIF('Fully Consumed'!$U$2:$U$2001,A41,'Fully Consumed'!$K$2:$K$2001)","v":24},{"$f":"SUMIF(Purchases!$U$3:$U$2002,A41,Purchases!$M$3:$M$2001)","v":1},4.1666666666666664E-2,{"$f":"10/IF(H41>0,(K41/'Summary Stats'!$B$4)^3*(L41/'Summary Stats'!$B$3)^3*MAX((O41-$R$1+1)^2,0.001)*3^B41*IF(LEN(P41)=0,1,IF(P41>=$R$1,P41-$R$1+1,1/($R$1+1-P41))^2),1000000000)","v":9.4514876508160164},91,{"$f":"IF(H41>0,SUMIF(Purchases!$U$3:$U$2002,A41,Purchases!$N$3:$N$2002)/H41,\"\")","v":15.400404810905457},15,null,2015,null,106,1,"","","","","","","","","","","","","","","","","","","","","","","",15.400404810905457,15,"Red",null,null,null,null,null,null,null,91,"Rater 2",null,null,null,null,"AU|","AU||",null,"Shiraz/Syrah",null,false]
["Riccardo Baracchi | 2010 | Syrah | Cortona Smeriglio | 0.75 L",1,"N","IT",2010,1781.6433027777748,{"$f":"SUMIF(Purchases!$U$3:$U$2002,A42,Purchases!$K$3:$K$2002)+SUMIF('Fully Consumed'!$U$2:$U$2001,A42,'Fully Consumed'!$K$2:$K$2001)","v":12},{"$f":"SUMIF(Purchases!$U$3:$U$2002,A42,Purchases!$M$3:$M$2001)","v":11},0.91666666666666663,{"$f":"10/IF(H42>0,(K42/'Summary Stats'!$B$4)^3*(L42/'Summary Stats'!$B$3)^3*MAX((O42-$R$1+1)^2,0.001)*3^B42*IF(LEN(P42)=0,1,IF(P42>=$R$1,P42-$R$1+1,1/($R$1+1-P42))^2),1000000000)","v":1.7647235302447262E-2},93,{"$f":"IF(H42>0,SUMIF(Purchases!$U$3:$U$2002,A42,Purchases!$N$3:$N$2002)/H42,\"\")","v":19.273108085811138},18.989999999999998,null,2030,null,507.72727272727275,0.20877350044762757,0.71888988361683082,0.71888988361683082,0.71888988361683082,0.71888988361683082,0.71888988361683082,0.71888988361683082,0.71888988361683082,0.71888988361683082,0.71888988361683082,0.71888988361683082,0.71888988361683082,0.71888988361683082,0.71888988361683082,0.71888988361683082,0.71888988361683082,"","","","","","","","",212.00418894392251,208.89,"Red",null,null,null,null,null,null,null,93,"Rater 2",null,null,null,null,"IT|","IT||",null,"Shiraz/Syrah",null,false]
["Denner | 2008 | Syrah & Viognier | Dirt Worshipper Paso Robles | 0.75 L",1,"N","US",2008,2511.6433027777748,{"$f":"SUMIF(Purchases!$U$3:$U$2002,A43,Purchases!$K$3:$K$2002)+SUMIF('Fully Consumed'!$U$2:$U$2001,A43,'Fully Consumed'!$K$2:$K$2001)","v":12},{"$f":"SUMIF(Purchases!$U$3:$U$2002,A43,Purchases!$M$3:$M$2001)","v":5},0.41666666666666669,{"$f":"10/IF(H43>0,(K43/'Summary Stats'!$B$4)^3*(L43/'Summary Stats'!$B$3)^3*MAX((O43-$R$1+1)^2,0.001)*3^B43*IF(LEN(P43)=0,1,IF(P43>=$R$1,P43-$R$1+1,1/($R$1+1-P43))^2),1000000000)","v":2.9732700974885655E-3},97,{"$f":"IF(H43>0,SUMIF(Purchases!$U$3:$U$2002,A43,Purchases!$N$3:$N$2002)/H43,\"\")","v":53.108463820695889},51.99,null,2022,null,532.6,0.1990236575291025,0.68531731130304163,0.68531731130304163,0.68531731130304163,0.68531731130304163,0.68531731130304163,0.68531731130304163,0.68531731130304163,"","","","","","","","","","","","","","","","",265.54231910347943,259.95,"Red",null,null,null,null,42319,null,null,97,"Rater 2",null,null,null,null,"US|","US||",null,"Shiraz/Syrah Blend",null,false]
["Tyrus Evan | 2007 | Syrah | Syrah Walla Walla Valley | 0.75 L",1,"N","US",2007,2877.6433027777748,{"$f":"SUMIF(Purchases!$U$3:$U$2002,A44,Purchases!$K$3:$K$2002)+SUMIF('Fully Consumed'!$U$2:$U$2001,A44,'Fully Consumed'!$K$2:$K$2001)","v":12},{"$f":"SUMIF(Purchases!$U$3:$U$2002,A44,Purchases!$M$3:$M$2001)","v":5},0.41666666666666669,{"$f":"10/IF(H44>0,(K44/'Summary Stats'!$B$4)^3*(L44/'Summary Stats'!$B$3)^3*MAX((O44-$R$1+1)^2,0.001)*3^B44*IF(LEN(P44)=0,1,IF(P44>=$R$1,P44-$R$1+1,1/($R$1+1-P44))^2),1000000000)","v":1.410989924952091E-2},95,{"$f":"IF(H44>0,SUMIF(Purchases!$U$3:$U$2002,A44,Purchases!$N$3:$N$2002)/H44,\"\")","v":39.090795611470938},37.99,null,2020,null,386.6,0.27418520434557681,0.94412829798241071,0.94412829798241071,0.94412829798241071,0.94412829798241071,0.94412829798241071,"","","","","","","","","","","","","","","","","","",195.45397805735468,189.95000000000002,"Red",null,null,null,null,null,null,null,95,"Rater 2",null,null,null,null,"US|","US||",null,"Shiraz/Syrah",null,false]
["Vina Santa Rita | 2009 | Syrah | Syrah Maipo Valley Reserva | 0.75 L",1,"S","AR",2009,2329.6433027777748,{"$f":"SUMIF(Purchases!$U$3:$U$2002,A45,Purchases!$K$3:$K$2002)+SUMIF('Fully Consumed'!$U$2:$U$2001,A45,'Fully Consumed'!$K$2:$K$2001)","v":24},{"$f":"SUMIF(Purchases!$U$3:$U$2002,A45,Purchases!$M$3:$M$2001)","v":18},0.75,{"$f":"10/IF(H45>0,(K45/'Summary Stats'!$B$4)^3*(L45/'Summary Stats'!$B$3)^3*MAX((O45-$R$1+1)^2,0.001)*3^B45*IF(LEN(P45)=0,1,IF(P45>=$R$1,P45-$R$1+1,1/($R$1+1-P45))^2),1000000000)","v":0.4592170475033408},92,{"$f":"IF(H45>0,SUMIF(Purchases!$U$3:$U$2002,A45,Purchases!$N$3:$N$2002)/H45,\"\")","v":12.642867637932302},12.21,null,2020,null,107.38888888888889,0.98706673564407654,3.3988618727366791,3.3988618727366791,3.3988618727366791,3.3988618727366791,3.3988618727366791,"","","","","","","","","","","","","","","","","","",227.57161748278142,219.78000000000003,"Red","Maipo Valley",null,null,null,null,null,null,92,"Rater 2",null,null,null,null,"AR|Maipo Valley","AR|Maipo Valley|",null,"Shiraz/Syrah",null,false]
["La Rioja Alta | 2004 | Tempranillo | Rioja  Viña Ardanza Reserva | 0.75 L",1,"N","ES",2004,3972.6433027777748,{"$f":"SUMIF(Purchases!$U$3:$U$2002,A46,Purchases!$K$3:$K$2002)+SUMIF('Fully Consumed'!$U$2:$U$2001,A46,'Fully Consumed'!$K$2:$K$2001)","v":12},{"$f":"SUMIF(Purchases!$U$3:$U$2002,A46,Purchases!$M$3:$M$2001)","v":12},1,{"$f":"10/IF(H46>0,(K46/'Summary Stats'!$B$4)^3*(L46/'Summary Stats'!$B$3)^3*MAX((O46-$R$1+1)^2,0.001)*3^B46*IF(LEN(P46)=0,1,IF(P46>=$R$1,P46-$R$1+1,1/($R$1+1-P46))^2),1000000000)","v":3.9572062405875609E-2},94,{"$f":"IF(H46>0,SUMIF(Purchases!$U$3:$U$2002,A46,Purchases!$N$3:$N$2002)/H46,\"\")","v":28.014443764954805},27.63,null,2020,null,161.08333333333334,0.65804449042938429,{"$f":"IF(ISNUMBER($Q46),IF(AND(S$1<=$O46,S$1>=$P46),365/$Q46,\"\"),\"\")","v":2.2659079151577859},2.2659079151577859,2.2659079151577859,2.2659079151577859,2.2659079151577859,"","","","","",{"$f":"IF(ISNUMBER($Q46),IF(AND(AC$1<=$O46,AC$1>=$P46),365/$Q46,\"\"),\"\")","v":""},"","","","","","","","","","","","",336.17332517945766,331.56,"Red",null,null,null,null,null,null,null,94,"Rater 2",null,null,null,null,"ES|","ES||",null,"Tempranillo Blend",null,false]
["Reynvaan Family Vineyards | 2012 | Syrah | In the Rocks | 0.75 L",2,"N","US",2012,1050.6433027777748,{"$f":"SUMIF(Purchases!$U$3:$U$2002,A47,Purchases!$K$3:$K$2002)+SUMIF('Fully Consumed'!$U$2:$U$2001,A47,'Fully Consumed'!$K$2:$K$2001)","v":3},{"$f":"SUMIF(Purchases!$U$3:$U$2002,A47,Purchases!$M$3:$M$2001)","v":2},0.66666666666666663,{"$f":"10/IF(H47>0,(K47/'Summary Stats'!$B$4)^3*(L47/'Summary Stats'!$B$3)^3*MAX((O47-$R$1+1)^2,0.001)*3^B47*IF(LEN(P47)=0,1,IF(P47>=$R$1,P47-$R$1+1,1/($R$1+1-P47))^2),1000000000)","v":3.9719683115344739E-4},94,{"$f":"IF(H47>0,SUMIF(Purchases!$U$3:$U$2002,A47,Purchases!$N$3:$N$2002)/H47,\"\")","v":74.332156276702875},72,null,2022,null,1331.5,7.9609463011641013E-2,0.27412692452121667,0.27412692452121667,0.27412692452121667,0.27412692452121667,0.27412692452121667,0.27412692452121667,0.27412692452121667,"","","","","","","","","","","","","","","","",148.66431255340575,144,"Red","Walla Walla Valley","The Rocks of Milton-Freewater",null,null,null,null,"Reynvaan",94,"Rater 2",null,null,null,null,"US|Walla Walla Valley","US|Walla Walla Valley|The Rocks of Milton-Freewater",null,"Shiraz/Syrah",null,false]
["Limerick Lane | 2013 | Petite Sirah | Petite Sirah | 0.75 L",1,"N","US",2013,685.64330277777481,{"$f":"SUMIF(Purchases!$U$3:$U$2002,A48,Purchases!$K$3:$K$2002)+SUMIF('Fully Consumed'!$U$2:$U$2001,A48,'Fully Consumed'!$K$2:$K$2001)","v":2},{"$f":"SUMIF(Purchases!$U$3:$U$2002,A48,Purchases!$M$3:$M$2001)","v":1},0.5,{"$f":"10/IF(H48>0,(K48/'Summary Stats'!$B$4)^3*(L48/'Summary Stats'!$B$3)^3*MAX((O48-$R$1+1)^2,0.001)*3^B48*IF(LEN(P48)=0,1,IF(P48>=$R$1,P48-$R$1+1,1/($R$1+1-P48))^2),1000000000)","v":5.3979511740841002E-3},92,{"$f":"IF(H48>0,SUMIF(Purchases!$U$3:$U$2002,A48,Purchases!$N$3:$N$2002)/H48,\"\")","v":50.173848577767608},49.43,null,2021,null,2298,4.6127067014795471E-2,0.15883376849434291,0.15883376849434291,0.15883376849434291,0.15883376849434291,0.15883376849434291,0.15883376849434291,"","","","","","","","","","","","","","","","","",50.173848577767608,49.43,"Red","Russian River Valley",null,null,null,null,null,"Limerick Lane",92,"Rater 1",null,null,null,null,"US|Russian River Valley","US|Russian River Valley|",null,"Petite Sirah",null,false]
["Schild | 2005 | Shiraz | Barossa | 0.75 L",5,"S","AU",2005,3790.6433027777748,{"$f":"SUMIF(Purchases!$U$3:$U$2002,A49,Purchases!$K$3:$K$2002)+SUMIF('Fully Consumed'!$U$2:$U$2001,A49,'Fully Consumed'!$K$2:$K$2001)","v":12},{"$f":"SUMIF(Purchases!$U$3:$U$2002,A49,Purchases!$M$3:$M$2001)","v":7},0.58333333333333337,{"$f":"10/IF(H49>0,(K49/'Summary Stats'!$B$4)^3*(L49/'Summary Stats'!$B$3)^3*MAX((O49-$R$1+1)^2,0.001)*3^B49*IF(LEN(P49)=0,1,IF(P49>=$R$1,P49-$R$1+1,1/($R$1+1-P49))^2),1000000000)","v":3.8250454211263118E-3},93,{"$f":"IF(H49>0,SUMIF(Purchases!$U$3:$U$2002,A49,Purchases!$N$3:$N$2002)/H49,\"\")","v":22.636151708364487},21.8,null,2017,null,119.57142857142857,0.88649940262843485,3.052568697729988,3.052568697729988,"","","","","","","","","","","","","","","","","","","","","",158.45306195855142,152.6,"Red",null,null,null,null,"16-07",null,null,93,"Rater 2",null,null,null,null,"AU|","AU||",null,"Shiraz/Syrah",null,false]
["K Vintners | 2012 | Tempranillo | El Jefe | 0.75 L",1,"N","US",2012,1050.6433027777748,{"$f":"SUMIF(Purchases!$U$3:$U$2002,A50,Purchases!$K$3:$K$2002)+SUMIF('Fully Consumed'!$U$2:$U$2001,A50,'Fully Consumed'!$K$2:$K$2001)","v":4},{"$f":"SUMIF(Purchases!$U$3:$U$2002,A50,Purchases!$M$3:$M$2001)","v":1},0.25,{"$f":"10/IF(H50>0,(K50/'Summary Stats'!$B$4)^3*(L50/'Summary Stats'!$B$3)^3*MAX((O50-$R$1+1)^2,0.001)*3^B50*IF(LEN(P50)=0,1,IF(P50>=$R$1,P50-$R$1+1,1/($R$1+1-P50))^2),1000000000)","v":1.8988071677954574E-3},91,{"$f":"IF(H50>0,SUMIF(Purchases!$U$3:$U$2002,A50,Purchases!$N$3:$N$2002)/H50,\"\")","v":65.737307942748075},63.72,null,2022,null,2663,3.9804731505820506E-2,0.13706346226060834,0.13706346226060834,0.13706346226060834,0.13706346226060834,0.13706346226060834,0.13706346226060834,0.13706346226060834,"","","","","","","","","","","","","","","","",65.737307942748075,63.72,"Red",null,null,null,null,null,null,"K Vintners",91,"Rater 1",null,null,null,null,"US|","US||",null,"Tempranillo Blend",null,false]
["Guy Saget | 2011 | Chenin Blanc | Marie Beauregard' Vouvray | 0.75 L",1,"N","FR",2011,1416.6433027777748,{"$f":"SUMIF(Purchases!$U$3:$U$2002,A51,Purchases!$K$3:$K$2002)+SUMIF('Fully Consumed'!$U$2:$U$2001,A51,'Fully Consumed'!$K$2:$K$2001)","v":12},{"$f":"SUMIF(Purchases!$U$3:$U$2002,A51,Purchases!$M$3:$M$2001)","v":12},1,{"$f":"10/IF(H51>0,(K51/'Summary Stats'!$B$4)^3*(L51/'Summary Stats'!$B$3)^3*MAX((O51-$R$1+1)^2,0.001)*3^B51*IF(LEN(P51)=0,1,IF(P51>=$R$1,P51-$R$1+1,1/($R$1+1-P51))^2),1000000000)","v":0.19055462333702392},92,{"$f":"IF(H51>0,SUMIF(Purchases!$U$3:$U$2002,A51,Purchases!$N$3:$N$2002)/H51,\"\")","v":16.950340564399955},16.309999999999999,null,2020,null,161.08333333333334,0.65804449042938429,2.2659079151577859,2.2659079151577859,2.2659079151577859,2.2659079151577859,2.2659079151577859,"","","","","","","","","","","","","","","","","","",203.40408677279947,195.71999999999997,"White",null,null,null,null,null,null,null,92,"Rater 2",null,null,null,null,"FR|","FR||",null,"Chenin Blanc",null,false]
["Chateau Tanunda | 2008 | Syrah | Grand Barossa Shiraz | 0.75 L",1,"S","AU",2008,2694.6433027777748,{"$f":"SUMIF(Purchases!$U$3:$U$2002,A52,Purchases!$K$3:$K$2002)+SUMIF('Fully Consumed'!$U$2:$U$2001,A52,'Fully Consumed'!$K$2:$K$2001)","v":24},{"$f":"SUMIF(Purchases!$U$3:$U$2002,A52,Purchases!$M$3:$M$2001)","v":2},8.3333333333333329E-2,{"$f":"10/IF(H52>0,(K52/'Summary Stats'!$B$4)^3*(L52/'Summary Stats'!$B$3)^3*MAX((O52-$R$1+1)^2,0.001)*3^B52*IF(LEN(P52)=0,1,IF(P52>=$R$1,P52-$R$1+1,1/($R$1+1-P52))^2),1000000000)","v":0.59053592904685526},92,{"$f":"IF(H52>0,SUMIF(Purchases!$U$3:$U$2002,A52,Purchases!$N$3:$N$2002)/H52,\"\")","v":15.234574278563262},14.97,null,2018,null,601,0.17637271214642264,0.60732113144758737,0.60732113144758737,0.60732113144758737,"","","","","","","","","","","","","","","","","","","","",30.469148557126523,29.94,"Red",null,null,null,null,"33-11",null,null,92,"Rater 2",null,null,null,null,"AU|","AU||",null,"Shiraz/Syrah",null,false]
["Viticcio | 2007 | Sangiovese | Chianti Classico Riserva | 0.75 L",1,"N","IT",2007,2877.6433027777748,{"$f":"SUMIF(Purchases!$U$3:$U$2002,A53,Purchases!$K$3:$K$2002)+SUMIF('Fully Consumed'!$U$2:$U$2001,A53,'Fully Consumed'!$K$2:$K$2001)","v":12},{"$f":"SUMIF(Purchases!$U$3:$U$2002,A53,Purchases!$M$3:$M$2001)","v":9},0.75,{"$f":"10/IF(H53>0,(K53/'Summary Stats'!$B$4)^3*(L53/'Summary Stats'!$B$3)^3*MAX((O53-$R$1+1)^2,0.001)*3^B53*IF(LEN(P53)=0,1,IF(P53>=$R$1,P53-$R$1+1,1/($R$1+1-P53))^2),1000000000)","v":5.0063363891479341E-2},93,{"$f":"IF(H53>0,SUMIF(Purchases!$U$3:$U$2002,A53,Purchases!$N$3:$N$2002)/H53,\"\")","v":21.61178493142128},20.99,null,2022,null,295.88888888888891,0.35824258355238447,1.2335711603454749,1.2335711603454749,1.2335711603454749,1.2335711603454749,1.2335711603454749,1.2335711603454749,1.2335711603454749,"","","","","","","","","","","","","","","","",194.50606438279152,188.91,"Red",null,null,null,null,"2010-40",null,null,93,"Rater 2",null,null,null,null,"IT|","IT||",null,"Sangiovese",null,false]
["Vinos de Arganza | 2012 | Mencia | Viño de la Tierra de Castilla y León Lagar de Robla Premium  | 0.75 L",1,"N","ES",2012,1050.6433027777748,{"$f":"SUMIF(Purchases!$U$3:$U$2002,A54,Purchases!$K$3:$K$2002)+SUMIF('Fully Consumed'!$U$2:$U$2001,A54,'Fully Consumed'!$K$2:$K$2001)","v":24},{"$f":"SUMIF(Purchases!$U$3:$U$2002,A54,Purchases!$M$3:$M$2001)","v":20},0.83333333333333337,{"$f":"10/IF(H54>0,(K54/'Summary Stats'!$B$4)^3*(L54/'Summary Stats'!$B$3)^3*MAX((O54-$R$1+1)^2,0.001)*3^B54*IF(LEN(P54)=0,1,IF(P54>=$R$1,P54-$R$1+1,1/($R$1+1-P54))^2),1000000000)","v":0.76072354145743681},91,{"$f":"IF(H54>0,SUMIF(Purchases!$U$3:$U$2002,A54,Purchases!$N$3:$N$2002)/H54,\"\")","v":8.917228945469855},8.9700000000000006,null,2022,null,133.15,0.79609463011641002,2.7412692452121665,2.7412692452121665,2.7412692452121665,2.7412692452121665,2.7412692452121665,2.7412692452121665,2.7412692452121665,"","","","","","","","","","","","","","","","",178.34457890939711,179.4,"Red",null,null,null,null,null,null,null,91,"Rater 2",null,null,null,null,"ES|","ES||",null,"Mencia",null,false]
["I Balzini | 2009 | Merlot, Cab S, Sangiovese | Red Label | 0.75 L",1,"N","IT",2009,2146.6433027777748,{"$f":"SUMIF(Purchases!$U$3:$U$2002,A55,Purchases!$K$3:$K$2002)+SUMIF('Fully Consumed'!$U$2:$U$2001,A55,'Fully Consumed'!$K$2:$K$2001)","v":12},{"$f":"SUMIF(Purchases!$U$3:$U$2002,A55,Purchases!$M$3:$M$2001)","v":10},0.83333333333333337,{"$f":"10/IF(H55>0,(K55/'Summary Stats'!$B$4)^3*(L55/'Summary Stats'!$B$3)^3*MAX((O55-$R$1+1)^2,0.001)*3^B55*IF(LEN(P55)=0,1,IF(P55>=$R$1,P55-$R$1+1,1/($R$1+1-P55))^2),1000000000)","v":4.2893880205691182E-2},93,{"$f":"IF(H55>0,SUMIF(Purchases!$U$3:$U$2002,A55,Purchases!$N$3:$N$2002)/H55,\"\")","v":18.401945322573184},17.989999999999998,null,2025,null,375.9,0.28198989092843846,0.97100292631018892,0.97100292631018892,0.97100292631018892,0.97100292631018892,0.97100292631018892,0.97100292631018892,0.97100292631018892,0.97100292631018892,0.97100292631018892,0.97100292631018892,"","","","","","","","","","","","","",184.01945322573184,179.89999999999998,"Red",null,null,null,null,null,null,null,93,"Rater 2",null,null,null,null,"IT|","IT||",null,"Merlot Blend",null,false]
["No Girls Wines | 2010 | Grenache | La Paciencia Vineyard | 0.75 L",2,"N","US",2010,1781.6433027777748,{"$f":"SUMIF(Purchases!$U$3:$U$2002,A56,Purchases!$K$3:$K$2002)+SUMIF('Fully Consumed'!$U$2:$U$2001,A56,'Fully Consumed'!$K$2:$K$2001)","v":3},{"$f":"SUMIF(Purchases!$U$3:$U$2002,A56,Purchases!$M$3:$M$2001)","v":1},0.33333333333333331,{"$f":"10/IF(H56>0,(K56/'Summary Stats'!$B$4)^3*(L56/'Summary Stats'!$B$3)^3*MAX((O56-$R$1+1)^2,0.001)*3^B56*IF(LEN(P56)=0,1,IF(P56>=$R$1,P56-$R$1+1,1/($R$1+1-P56))^2),1000000000)","v":6.7345494573844175E-4},92,{"$f":"IF(H56>0,SUMIF(Purchases!$U$3:$U$2002,A56,Purchases!$N$3:$N$2002)/H56,\"\")","v":77.156939283013344},75,null,2020,null,1933,5.4837040869115367E-2,0.18882565959648215,0.18882565959648215,0.18882565959648215,0.18882565959648215,0.18882565959648215,"","","","","","","","","","","","","","","","","","",77.156939283013344,75,"Red","Walla Walla Valley","The Rocks of Milton-Freewater",null,null,null,null,"The Rocks of Milton-Freewater",92,"Rater 2",null,null,null,null,"US|Walla Walla Valley","US|Walla Walla Valley|The Rocks of Milton-Freewater",null,"Grenache","No Girls",false]
["Domaine Saint Prefert | 2005 | Chateauneuf Du Pape | Reserve Auguste Favier | 0.75 L",1,"N","FR",2005,3607.6433027777748,{"$f":"SUMIF(Purchases!$U$3:$U$2002,A57,Purchases!$K$3:$K$2002)+SUMIF('Fully Consumed'!$U$2:$U$2001,A57,'Fully Consumed'!$K$2:$K$2001)","v":12},{"$f":"SUMIF(Purchases!$U$3:$U$2002,A57,Purchases!$M$3:$M$2001)","v":10},0.83333333333333337,{"$f":"10/IF(H57>0,(K57/'Summary Stats'!$B$4)^3*(L57/'Summary Stats'!$B$3)^3*MAX((O57-$R$1+1)^2,0.001)*3^B57*IF(LEN(P57)=0,1,IF(P57>=$R$1,P57-$R$1+1,1/($R$1+1-P57))^2),1000000000)","v":2.2015895434117994E-3},95,{"$f":"IF(H57>0,SUMIF(Purchases!$U$3:$U$2002,A57,Purchases!$N$3:$N$2002)/H57,\"\")","v":43.365293960273263},41.91,null,2027,null,448.9,0.23613276899086658,0.81309868567609722,0.81309868567609722,0.81309868567609722,0.81309868567609722,0.81309868567609722,0.81309868567609722,0.81309868567609722,0.81309868567609722,0.81309868567609722,0.81309868567609722,0.81309868567609722,0.81309868567609722,"","","","","","","","","","","",433.65293960273266,419.09999999999997,"Red",null,null,null,null,null,null,"2005 Châteauneuf-du-Pape",95,"Rater 2",null,null,null,null,"FR|","FR||",null,"Grenache Blend",null,false]
["Dow | 2011 | Port | Vintage Porto | 0.75 L",1,"N","PT",2011,1416.6433027777748,{"$f":"SUMIF(Purchases!$U$3:$U$2002,A58,Purchases!$K$3:$K$2002)+SUMIF('Fully Consumed'!$U$2:$U$2001,A58,'Fully Consumed'!$K$2:$K$2001)","v":4},{"$f":"SUMIF(Purchases!$U$3:$U$2002,A58,Purchases!$M$3:$M$2001)","v":4},1,{"$f":"10/IF(H58>0,(K58/'Summary Stats'!$B$4)^3*(L58/'Summary Stats'!$B$3)^3*MAX((O58-$R$1+1)^2,0.001)*3^B58*IF(LEN(P58)=0,1,IF(P58>=$R$1,P58-$R$1+1,1/($R$1+1-P58))^2),1000000000)","v":2.7712070865767133E-7},99,{"$f":"IF(H58>0,SUMIF(Purchases!$U$3:$U$2002,A58,Purchases!$N$3:$N$2002)/H58,\"\")","v":66.313264630794521},65.989999999999995,null,2050,2030,1917.25,"",{"$f":"IF(ISNUMBER($Q58),IF(AND(S$1<=$O58,S$1>=$P58),365/$Q58,\"\"),\"\")","v":""},"","","","","","","","","",{"$f":"IF(ISNUMBER($Q58),IF(AND(AC$1<=$O58,AC$1>=$P58),365/$Q58,\"\"),\"\")","v":""},"","","",0.19037684183074716,0.19037684183074716,0.19037684183074716,0.19037684183074716,0.19037684183074716,0.19037684183074716,0.19037684183074716,0.19037684183074716,0.19037684183074716,265.25305852317808,263.95999999999998,"Dessert",null,null,null,null,41653,null,null,99,"Rater 2",null,null,null,null,"PT|","PT||",null,"Port",null,false]
["Corrina Rayment | 2005 | Shiraz | Expatriate Shiraz | 0.75 L",1,"S","AU",2005,3790.6433027777748,{"$f":"SUMIF(Purchases!$U$3:$U$2002,A59,Purchases!$K$3:$K$2002)+SUMIF('Fully Consumed'!$U$2:$U$2001,A59,'Fully Consumed'!$K$2:$K$2001)","v":12},{"$f":"SUMIF(Purchases!$U$3:$U$2002,A59,Purchases!$M$3:$M$2001)","v":4},0.33333333333333331,{"$f":"10/IF(H59>0,(K59/'Summary Stats'!$B$4)^3*(L59/'Summary Stats'!$B$3)^3*MAX((O59-$R$1+1)^2,0.001)*3^B59*IF(LEN(P59)=0,1,IF(P59>=$R$1,P59-$R$1+1,1/($R$1+1-P59))^2),1000000000)","v":1.0697143200910673E-2},95,{"$f":"IF(H59>0,SUMIF(Purchases!$U$3:$U$2002,A59,Purchases!$N$3:$N$2002)/H59,\"\")","v":42.870631153464316},41.82,null,2020,null,483.25,0.21934816347646147,0.75530263838592859,0.75530263838592859,0.75530263838592859,0.75530263838592859,0.75530263838592859,"","","","","","","","","","","","","","","","","","",171.48252461385727,167.28,"Red",null,null,null,null,null,null,null,95,"Rater 2",null,null,null,null,"AU|","AU||",null,"Shiraz/Syrah",null,false]
["La Serena | 2010 | Brunello (Sangiovese) | Brunello di Montalcino | 0.75 L",2,"N","IT",2010,1781.6433027777748,{"$f":"SUMIF(Purchases!$U$3:$U$2002,A60,Purchases!$K$3:$K$2002)+SUMIF('Fully Consumed'!$U$2:$U$2001,A60,'Fully Consumed'!$K$2:$K$2001)","v":12},{"$f":"SUMIF(Purchases!$U$3:$U$2002,A60,Purchases!$M$3:$M$2001)","v":12},1,{"$f":"10/IF(H60>0,(K60/'Summary Stats'!$B$4)^3*(L60/'Summary Stats'!$B$3)^3*MAX((O60-$R$1+1)^2,0.001)*3^B60*IF(LEN(P60)=0,1,IF(P60>=$R$1,P60-$R$1+1,1/($R$1+1-P60))^2),1000000000)","v":5.9611556049772101E-6},96,{"$f":"IF(H60>0,SUMIF(Purchases!$U$3:$U$2002,A60,Purchases!$N$3:$N$2002)/H60,\"\")","v":51.411071873575445},49.01,null,2036,2019,547.83333333333337,"","","","",0.66626102829327649,0.66626102829327649,0.66626102829327649,0.66626102829327649,0.66626102829327649,0.66626102829327649,0.66626102829327649,0.66626102829327649,0.66626102829327649,0.66626102829327649,0.66626102829327649,0.66626102829327649,0.66626102829327649,0.66626102829327649,0.66626102829327649,0.66626102829327649,0.66626102829327649,0.66626102829327649,"","",616.93286248290531,588.12,"Red",null,null,null,null,null,null,"2010 Brunello",96,"Rater 2",null,null,null,null,"IT|","IT||",null,"Brunello",null,false]
["Condado de Haza | 2005 | Tempranillo Blend | Ribera del Duero Crianza | 0.75 L",1,"N","ES",2005,3607.6433027777748,{"$f":"SUMIF(Purchases!$U$3:$U$2002,A61,Purchases!$K$3:$K$2002)+SUMIF('Fully Consumed'!$U$2:$U$2001,A61,'Fully Consumed'!$K$2:$K$2001)","v":12},{"$f":"SUMIF(Purchases!$U$3:$U$2002,A61,Purchases!$M$3:$M$2001)","v":8},0.66666666666666663,{"$f":"10/IF(H61>0,(K61/'Summary Stats'!$B$4)^3*(L61/'Summary Stats'!$B$3)^3*MAX((O61-$R$1+1)^2,0.001)*3^B61*IF(LEN(P61)=0,1,IF(P61>=$R$1,P61-$R$1+1,1/($R$1+1-P61))^2),1000000000)","v":0.12416217146320811},93,{"$f":"IF(H61>0,SUMIF(Purchases!$U$3:$U$2002,A61,Purchases!$N$3:$N$2002)/H61,\"\")","v":25.34472268089652},24.71,null,2018,null,150.25,0.70549084858569056,2.4292845257903495,2.4292845257903495,2.4292845257903495,"","","","","","","","","","","","","","","","","","","","",202.75778144717216,197.68,"Red",null,null,null,null,"34-08",null,null,93,"Rater 2",null,null,null,null,"ES|","ES||",null,"Tempranillo Blend",null,false]
["Durand (Eric & Joel) | 2010 | Syrah | Cornas Premises | 0.75 L",1,"N","FR",2010,1781.6433027777748,{"$f":"SUMIF(Purchases!$U$3:$U$2002,A62,Purchases!$K$3:$K$2002)+SUMIF('Fully Consumed'!$U$2:$U$2001,A62,'Fully Consumed'!$K$2:$K$2001)","v":12},{"$f":"SUMIF(Purchases!$U$3:$U$2002,A62,Purchases!$M$3:$M$2001)","v":10},0.83333333333333337,{"$f":"10/IF(H62>0,(K62/'Summary Stats'!$B$4)^3*(L62/'Summary Stats'!$B$3)^3*MAX((O62-$R$1+1)^2,0.001)*3^B62*IF(LEN(P62)=0,1,IF(P62>=$R$1,P62-$R$1+1,1/($R$1+1-P62))^2),1000000000)","v":2.6359512759007227E-2},93,{"$f":"IF(H62>0,SUMIF(Purchases!$U$3:$U$2002,A62,Purchases!$N$3:$N$2002)/H62,\"\")","v":24.742856621563433},23.99,null,2023,null,302.8,0.35006605019815057,1.2054161162483488,1.2054161162483488,1.2054161162483488,1.2054161162483488,1.2054161162483488,1.2054161162483488,1.2054161162483488,1.2054161162483488,"","","","","","","","","","","","","","","",247.42856621563433,239.89999999999998,"Red",null,null,null,null,null,null,null,93,"Rater 2",null,null,null,null,"FR|","FR||",null,"Shiraz/Syrah",null,false]
["Jean-Luc Columbo | 2010 | Syrah | Cornas La Louvée | 0.75 L",1,"N","FR",2010,1781.6433027777748,{"$f":"SUMIF(Purchases!$U$3:$U$2002,A63,Purchases!$K$3:$K$2002)+SUMIF('Fully Consumed'!$U$2:$U$2001,A63,'Fully Consumed'!$K$2:$K$2001)","v":12},{"$f":"SUMIF(Purchases!$U$3:$U$2002,A63,Purchases!$M$3:$M$2001)","v":12},1,{"$f":"10/IF(H63>0,(K63/'Summary Stats'!$B$4)^3*(L63/'Summary Stats'!$B$3)^3*MAX((O63-$R$1+1)^2,0.001)*3^B63*IF(LEN(P63)=0,1,IF(P63>=$R$1,P63-$R$1+1,1/($R$1+1-P63))^2),1000000000)","v":1.5089254296010361E-3},96,{"$f":"IF(H63>0,SUMIF(Purchases!$U$3:$U$2002,A63,Purchases!$N$3:$N$2002)/H63,\"\")","v":42.380535384744405},41.99,null,2030,null,465.41666666666669,0.22775290957923008,0.78424350940017906,0.78424350940017906,0.78424350940017906,0.78424350940017906,0.78424350940017906,0.78424350940017906,0.78424350940017906,0.78424350940017906,0.78424350940017906,0.78424350940017906,0.78424350940017906,0.78424350940017906,0.78424350940017906,0.78424350940017906,0.78424350940017906,"","","","","","","","",508.56642461693286,503.88,"Red",null,null,null,null,null,null,null,96,"Rater 2",null,null,null,null,"FR|","FR||",null,"Shiraz/Syrah",null,false]
["Pelissero | 2006 | Nebbiolo & Barbera | Langhe Long Now | 0.75 L",1,"N","IT",2006,3242.6433027777748,{"$f":"SUMIF(Purchases!$U$3:$U$2002,A64,Purchases!$K$3:$K$2002)+SUMIF('Fully Consumed'!$U$2:$U$2001,A64,'Fully Consumed'!$K$2:$K$2001)","v":12},{"$f":"SUMIF(Purchases!$U$3:$U$2002,A64,Purchases!$M$3:$M$2001)","v":9},0.75,{"$f":"10/IF(H64>0,(K64/'Summary Stats'!$B$4)^3*(L64/'Summary Stats'!$B$3)^3*MAX((O64-$R$1+1)^2,0.001)*3^B64*IF(LEN(P64)=0,1,IF(P64>=$R$1,P64-$R$1+1,1/($R$1+1-P64))^2),1000000000)","v":1.0928244586641054E-3},95,{"$f":"IF(H64>0,SUMIF(Purchases!$U$3:$U$2002,A64,Purchases!$N$3:$N$2002)/H64,\"\")","v":34.502530360937122},34.32,null,2040,null,1026.4444444444443,0.1032691058670708,0.35559644944793251,0.35559644944793251,0.35559644944793251,0.35559644944793251,0.35559644944793251,0.35559644944793251,0.35559644944793251,0.35559644944793251,0.35559644944793251,0.35559644944793251,0.35559644944793251,0.35559644944793251,0.35559644944793251,0.35559644944793251,0.35559644944793251,0.35559644944793251,0.35559644944793251,0.35559644944793251,0.35559644944793251,0.35559644944793251,0.35559644944793251,0.35559644944793251,0.35559644944793251,310.52277324843408,308.88,"Red",null,null,null,null,null,null,null,95,"Rater 2",null,null,null,null,"IT|","IT||",null,"Nebbiolo Blend",null,false]
["Neyers | 2007 | Syrah | Sonoma Coast Old Lakeville Road  | 0.75 L",1,"N","US",2007,2877.6433027777748,{"$f":"SUMIF(Purchases!$U$3:$U$2002,A65,Purchases!$K$3:$K$2002)+SUMIF('Fully Consumed'!$U$2:$U$2001,A65,'Fully Consumed'!$K$2:$K$2001)","v":12},{"$f":"SUMIF(Purchases!$U$3:$U$2002,A65,Purchases!$M$3:$M$2001)","v":3},0.25,{"$f":"10/IF(H65>0,(K65/'Summary Stats'!$B$4)^3*(L65/'Summary Stats'!$B$3)^3*MAX((O65-$R$1+1)^2,0.001)*3^B65*IF(LEN(P65)=0,1,IF(P65>=$R$1,P65-$R$1+1,1/($R$1+1-P65))^2),1000000000)","v":0.24928740746973088},94,{"$f":"IF(H65>0,SUMIF(Purchases!$U$3:$U$2002,A65,Purchases!$N$3:$N$2002)/H65,\"\")","v":31.551907622337342},30.34,null,2016,null,157.33333333333334,0.67372881355932202,2.3199152542372881,"","","","","","","","","","","","","","","","","","","","","","",94.655722867012031,91.02,"Red",null,null,null,null,null,null,null,94,"Rater 2",null,null,null,null,"US|","US||",null,"Shiraz/Syrah Blend",null,false]
["Owen Roe | 2008 | Syrah | Yakima Valley Red Willow Vineyard | 0.75 L",1,"N","US",2008,2511.6433027777748,{"$f":"SUMIF(Purchases!$U$3:$U$2002,A66,Purchases!$K$3:$K$2002)+SUMIF('Fully Consumed'!$U$2:$U$2001,A66,'Fully Consumed'!$K$2:$K$2001)","v":6},{"$f":"SUMIF(Purchases!$U$3:$U$2002,A66,Purchases!$M$3:$M$2001)","v":3},0.5,{"$f":"10/IF(H66>0,(K66/'Summary Stats'!$B$4)^3*(L66/'Summary Stats'!$B$3)^3*MAX((O66-$R$1+1)^2,0.001)*3^B66*IF(LEN(P66)=0,1,IF(P66>=$R$1,P66-$R$1+1,1/($R$1+1-P66))^2),1000000000)","v":6.1100356638992728E-2},97,{"$f":"IF(H66>0,SUMIF(Purchases!$U$3:$U$2002,A66,Purchases!$N$3:$N$2002)/H66,\"\")","v":48.857803633630276},47.26,null,2016,null,157.33333333333334,0.67372881355932202,{"$f":"IF(ISNUMBER($Q66),IF(AND(S$1<=$O66,S$1>=$P66),365/$Q66,\"\"),\"\")","v":2.3199152542372881},"","","","","","","","","",{"$f":"IF(ISNUMBER($Q66),IF(AND(AC$1<=$O66,AC$1>=$P66),365/$Q66,\"\"),\"\")","v":""},"","","","","","","","","","","","",146.57341090089082,141.78,"Red",null,null,null,null,null,null,null,97,"Rater 2",null,null,null,null,"US|","US||",null,"Shiraz/Syrah",null,false]
["La Colombina | 2010 | Brunello | Brunello di Montalcino | 0.75 L",1,"N","IT",2010,1781.6433027777748,{"$f":"SUMIF(Purchases!$U$3:$U$2002,A67,Purchases!$K$3:$K$2002)+SUMIF('Fully Consumed'!$U$2:$U$2001,A67,'Fully Consumed'!$K$2:$K$2001)","v":6},{"$f":"SUMIF(Purchases!$U$3:$U$2002,A67,Purchases!$M$3:$M$2001)","v":6},1,{"$f":"10/IF(H67>0,(K67/'Summary Stats'!$B$4)^3*(L67/'Summary Stats'!$B$3)^3*MAX((O67-$R$1+1)^2,0.001)*3^B67*IF(LEN(P67)=0,1,IF(P67>=$R$1,P67-$R$1+1,1/($R$1+1-P67))^2),1000000000)","v":9.0211089285253799E-5},95,{"$f":"IF(H67>0,SUMIF(Purchases!$U$3:$U$2002,A67,Purchases!$N$3:$N$2002)/H67,\"\")","v":36.258554069817066},35.97,null,2035,2018,1095.5,"","","",0.33318119580100408,0.33318119580100408,0.33318119580100408,0.33318119580100408,0.33318119580100408,0.33318119580100408,0.33318119580100408,0.33318119580100408,0.33318119580100408,0.33318119580100408,0.33318119580100408,0.33318119580100408,0.33318119580100408,0.33318119580100408,0.33318119580100408,0.33318119580100408,0.33318119580100408,0.33318119580100408,"","","",217.5513244189024,215.82,"Red",null,null,null,null,null,null,null,95,"Rater 2",null,null,null,null,"IT|","IT||",null,"Brunello",null,false]
["Pillar Box | 2008 | Shiraz | Reserve Shiraz | 0.75 L",1,"S","AU",2008,2694.6433027777748,{"$f":"SUMIF(Purchases!$U$3:$U$2002,A68,Purchases!$K$3:$K$2002)+SUMIF('Fully Consumed'!$U$2:$U$2001,A68,'Fully Consumed'!$K$2:$K$2001)","v":12},{"$f":"SUMIF(Purchases!$U$3:$U$2002,A68,Purchases!$M$3:$M$2001)","v":12},1,{"$f":"10/IF(H68>0,(K68/'Summary Stats'!$B$4)^3*(L68/'Summary Stats'!$B$3)^3*MAX((O68-$R$1+1)^2,0.001)*3^B68*IF(LEN(P68)=0,1,IF(P68>=$R$1,P68-$R$1+1,1/($R$1+1-P68))^2),1000000000)","v":0.21727163047751669},92,{"$f":"IF(H68>0,SUMIF(Purchases!$U$3:$U$2002,A68,Purchases!$N$3:$N$2002)/H68,\"\")","v":16.224970557212828},16.82,null,2020,null,161.08333333333334,0.65804449042938429,2.2659079151577859,2.2659079151577859,2.2659079151577859,2.2659079151577859,2.2659079151577859,"","","","","","","","","","","","","","","","","","",194.69964668655393,201.84,"Red",null,null,null,null,null,null,null,92,"Rater 2",null,null,null,null,"AU|","AU||",null,"Shiraz/Syrah",null,false]
["Reynvaan Family Vineyards | 2011 | Syrah | In the Rocks | 0.75 L",2,"N","US",2011,1416.6433027777748,{"$f":"SUMIF(Purchases!$U$3:$U$2002,A69,Purchases!$K$3:$K$2002)+SUMIF('Fully Consumed'!$U$2:$U$2001,A69,'Fully Consumed'!$K$2:$K$2001)","v":3},{"$f":"SUMIF(Purchases!$U$3:$U$2002,A69,Purchases!$M$3:$M$2001)","v":1},0.33333333333333331,{"$f":"10/IF(H69>0,(K69/'Summary Stats'!$B$4)^3*(L69/'Summary Stats'!$B$3)^3*MAX((O69-$R$1+1)^2,0.001)*3^B69*IF(LEN(P69)=0,1,IF(P69>=$R$1,P69-$R$1+1,1/($R$1+1-P69))^2),1000000000)","v":1.352183513915678E-4},93,{"$f":"IF(H69>0,SUMIF(Purchases!$U$3:$U$2002,A69,Purchases!$N$3:$N$2002)/H69,\"\")","v":74.094558855980637},73.13,null,2021,2016,2191,"",0.16659059790050204,0.16659059790050204,0.16659059790050204,0.16659059790050204,0.16659059790050204,0.16659059790050204,"","","","","","","","","","","","","","","","","",74.094558855980637,73.13,"Red","Walla Walla Valley",null,null,null,null,null,"The Rocks of Milton-Freewater",93,"Rater 2",null,null,null,null,"US|Walla Walla Valley","US|Walla Walla Valley|",null,"Shiraz/Syrah","Reynvaan",false]
["Tommasi | 2011 | Sangiovese & Cab S | Poggio Al Tufo Rompicollo | 0.75 L",1,"N","IT",2011,{"$f":"NOW()-IF(C70=\"N\",DATE(E70,10,31),DATE(E70,4,31))","v":1416.6433027777748},{"$f":"SUMIF(Purchases!$U$3:$U$2002,A70,Purchases!$K$3:$K$2002)+SUMIF('Fully Consumed'!$U$2:$U$2001,A70,'Fully Consumed'!$K$2:$K$2001)","v":12},{"$f":"SUMIF(Purchases!$U$3:$U$2002,A70,Purchases!$M$3:$M$2001)","v":12},{"$f":"H70/G70","v":1},{"$f":"10/IF(H70>0,(K70/'Summary Stats'!$B$4)^3*(L70/'Summary Stats'!$B$3)^3*MAX((O70-$R$1+1)^2,0.001)*3^B70*IF(LEN(P70)=0,1,IF(P70>=$R$1,P70-$R$1+1,1/($R$1+1-P70))^2),1000000000)","v":0.17044595029611775},92,{"$f":"IF(H70>0,SUMIF(Purchases!$U$3:$U$2002,A70,Purchases!$N$3:$N$2002)/H70,\"\")","v":14.522126151800157},14.17,null,2022,null,{"$f":"IF(AND(LEN(O70)>0,H70>0),(DATE(O70,12,31)-MAX(FLOOR(NOW(),1),DATE(P70,1,1)))/H70,\"\")","v":221.91666666666666},{"$f":"IF(R$1<=$O70,IF(AND(ISNUMBER(Q70),R$1>=$P70),(DATE(R$1,12,31)-INT(NOW()))/Q70,\"\"),H70)","v":0.47765677806984608},1.6447615471273,1.6447615471273,1.6447615471273,1.6447615471273,1.6447615471273,1.6447615471273,1.6447615471273,"","","","","","","","","","","","","","","","",{"$f":"H70*L70","v":174.26551382160187},{"$f":"M70*H70","v":170.04},"Red",null,null,null,null,"31-14",null,null,92,"Rater 2",null,null,null,null,{"$f":"D70&\"|\"&AS70","v":"IT|"},{"$f":"BF70&\"|\"&AT70","v":"IT||"},null,"Sangiovese Blend",null,false]
["Tensley | 2008 | Syrah | Santa Barbara County Colson Canyon V | 0.75 L",1,"N","US",2008,2511.6433027777748,{"$f":"SUMIF(Purchases!$U$3:$U$2002,A71,Purchases!$K$3:$K$2002)+SUMIF('Fully Consumed'!$U$2:$U$2001,A71,'Fully Consumed'!$K$2:$K$2001)","v":12},{"$f":"SUMIF(Purchases!$U$3:$U$2002,A71,Purchases!$M$3:$M$2001)","v":5},0.41666666666666669,{"$f":"10/IF(H71>0,(K71/'Summary Stats'!$B$4)^3*(L71/'Summary Stats'!$B$3)^3*MAX((O71-$R$1+1)^2,0.001)*3^B71*IF(LEN(P71)=0,1,IF(P71>=$R$1,P71-$R$1+1,1/($R$1+1-P71))^2),1000000000)","v":6.2251275072961451E-2},95,{"$f":"IF(H71>0,SUMIF(Purchases!$U$3:$U$2002,A71,Purchases!$N$3:$N$2002)/H71,\"\")","v":37.834360173851252},36.270000000000003,null,2017,null,167.4,0.63321385902031058,2.1804062126642769,2.1804062126642769,"","","","","","","","","","","","","","","","","","","","","",189.17180086925626,181.35000000000002,"Red",null,null,null,null,null,null,null,95,"Rater 2",null,null,null,null,"US|","US||",null,"Shiraz/Syrah",null,false]
["Domaine Giraud | 2010 | Chateauneuf du Pape | Chateauneuf du Pape Tradition | 0.75 L",1,"N","FR",2010,{"$f":"NOW()-IF(C72=\"N\",DATE(E72,10,31),DATE(E72,4,31))","v":1781.6433027777748},{"$f":"SUMIF(Purchases!$U$3:$U$2002,A72,Purchases!$K$3:$K$2002)+SUMIF('Fully Consumed'!$U$2:$U$2001,A72,'Fully Consumed'!$K$2:$K$2001)","v":12},{"$f":"SUMIF(Purchases!$U$3:$U$2002,A72,Purchases!$M$3:$M$2001)","v":11},{"$f":"H72/G72","v":0.91666666666666663},{"$f":"10/IF(H72>0,(K72/'Summary Stats'!$B$4)^3*(L72/'Summary Stats'!$B$3)^3*MAX((O72-$R$1+1)^2,0.001)*3^B72*IF(LEN(P72)=0,1,IF(P72>=$R$1,P72-$R$1+1,1/($R$1+1-P72))^2),1000000000)","v":1.5051247354033377E-3},95,{"$f":"IF(H72>0,SUMIF(Purchases!$U$3:$U$2002,A72,Purchases!$N$3:$N$2002)/H72,\"\")","v":42.862664155453444},40.99,null,2030,null,{"$f":"IF(AND(LEN(O72)>0,H72>0),(DATE(O72,12,31)-MAX(FLOOR(NOW(),1),DATE(P72,1,1)))/H72,\"\")","v":507.72727272727275},{"$f":"IF(R$1<=$O72,IF(AND(ISNUMBER(Q72),R$1>=$P72),(DATE(R$1,12,31)-INT(NOW()))/Q72,\"\"),H72)","v":0.20877350044762757},0.71888988361683082,0.71888988361683082,0.71888988361683082,0.71888988361683082,0.71888988361683082,0.71888988361683082,0.71888988361683082,0.71888988361683082,0.71888988361683082,0.71888988361683082,0.71888988361683082,0.71888988361683082,0.71888988361683082,0.71888988361683082,0.71888988361683082,"","","","","","","","",{"$f":"H72*L72","v":471.48930570998789},{"$f":"M72*H72","v":450.89000000000004},"Red",null,null,null,null,null,null,null,95,"Rater 2",null,null,null,null,{"$f":"D72&\"|\"&AS72","v":"FR|"},{"$f":"BF72&\"|\"&AT72","v":"FR||"},null,"Grenache Blend",null,false]
["Chateau Monbrison | 2005 | Bordeaux blend | Grand Vin de Margaux | 0.75 L",1,"N","FR",2005,3607.6433027777748,{"$f":"SUMIF(Purchases!$U$3:$U$2002,A73,Purchases!$K$3:$K$2002)+SUMIF('Fully Consumed'!$U$2:$U$2001,A73,'Fully Consumed'!$K$2:$K$2001)","v":11},{"$f":"SUMIF(Purchases!$U$3:$U$2002,A73,Purchases!$M$3:$M$2001)","v":11},1,{"$f":"10/IF(H73>0,(K73/'Summary Stats'!$B$4)^3*(L73/'Summary Stats'!$B$3)^3*MAX((O73-$R$1+1)^2,0.001)*3^B73*IF(LEN(P73)=0,1,IF(P73>=$R$1,P73-$R$1+1,1/($R$1+1-P73))^2),1000000000)","v":2.2578582858221049E-3},91,{"$f":"IF(H73>0,SUMIF(Purchases!$U$3:$U$2002,A73,Purchases!$N$3:$N$2002)/H73,\"\")","v":36.136961281895637},35.42,null,2032,null,574.18181818181813,0.1846105129829006,0.63568714376187463,0.63568714376187463,0.63568714376187463,0.63568714376187463,0.63568714376187463,0.63568714376187463,0.63568714376187463,0.63568714376187463,0.63568714376187463,0.63568714376187463,0.63568714376187463,0.63568714376187463,0.63568714376187463,0.63568714376187463,0.63568714376187463,0.63568714376187463,0.63568714376187463,"","","","","","",397.50657410085199,389.62,"Red",null,null,null,null,null,null,"2005 Bordeaux",91,"Rater 2",null,null,null,null,"FR|","FR||",null,"Cab S Blend",null,false]
["Vinosia | 2004 | Aglianico | Taurasi | 0.75 L",1,"N","IT",2004,3972.6433027777748,{"$f":"SUMIF(Purchases!$U$3:$U$2002,A74,Purchases!$K$3:$K$2002)+SUMIF('Fully Consumed'!$U$2:$U$2001,A74,'Fully Consumed'!$K$2:$K$2001)","v":12},{"$f":"SUMIF(Purchases!$U$3:$U$2002,A74,Purchases!$M$3:$M$2001)","v":10},0.83333333333333337,{"$f":"10/IF(H74>0,(K74/'Summary Stats'!$B$4)^3*(L74/'Summary Stats'!$B$3)^3*MAX((O74-$R$1+1)^2,0.001)*3^B74*IF(LEN(P74)=0,1,IF(P74>=$R$1,P74-$R$1+1,1/($R$1+1-P74))^2),1000000000)","v":7.0942391522001172E-2},93,{"$f":"IF(H74>0,SUMIF(Purchases!$U$3:$U$2002,A74,Purchases!$N$3:$N$2002)/H74,\"\")","v":23.308868713676929},22.82,null,2020,null,193.3,0.54837040869115361,1.8882565959648214,1.8882565959648214,1.8882565959648214,1.8882565959648214,1.8882565959648214,"","","","","","","","","","","","","","","","","","",233.08868713676929,228.2,"Red","Campania",null,null,null,null,null,null,93,"Rater 2",null,null,null,null,"IT|Campania","IT|Campania|",null,"Aglianico",null,false]
["Turley | 2013 | Zinfandel | Zinfandel Duarte Vineyard | 0.75 L",1,"N","US",2013,685.64330277777481,{"$f":"SUMIF(Purchases!$U$3:$U$2002,A75,Purchases!$K$3:$K$2002)+SUMIF('Fully Consumed'!$U$2:$U$2001,A75,'Fully Consumed'!$K$2:$K$2001)","v":2},{"$f":"SUMIF(Purchases!$U$3:$U$2002,A75,Purchases!$M$3:$M$2001)","v":2},1,{"$f":"10/IF(H75>0,(K75/'Summary Stats'!$B$4)^3*(L75/'Summary Stats'!$B$3)^3*MAX((O75-$R$1+1)^2,0.001)*3^B75*IF(LEN(P75)=0,1,IF(P75>=$R$1,P75-$R$1+1,1/($R$1+1-P75))^2),1000000000)","v":5.6142775171410097E-3},92,{"$f":"IF(H75>0,SUMIF(Purchases!$U$3:$U$2002,A75,Purchases!$N$3:$N$2002)/H75,\"\")","v":41.881876041412355},40.32,null,2023,null,1514,7.0013210039630125E-2,0.24108322324966974,0.24108322324966974,0.24108322324966974,0.24108322324966974,0.24108322324966974,0.24108322324966974,0.24108322324966974,0.24108322324966974,"","","","","","","","","","","","","","","",83.763752082824709,80.64,"Red","Contra Costa County","Duarte Vineyard",null,null,null,null,"Turley",90,"Rater 2",null,null,null,null,"US|Contra Costa County","US|Contra Costa County|Duarte Vineyard",null,"Zinfandel",null,false]
["Two Hands | 2005 | Shiraz | Bella's Garden Barossa Valley | 0.75 L",1,"S","AU",2005,3790.6433027777748,{"$f":"SUMIF(Purchases!$U$3:$U$2002,A76,Purchases!$K$3:$K$2002)+SUMIF('Fully Consumed'!$U$2:$U$2001,A76,'Fully Consumed'!$K$2:$K$2001)","v":12},{"$f":"SUMIF(Purchases!$U$3:$U$2002,A76,Purchases!$M$3:$M$2001)","v":4},0.33333333333333331,{"$f":"10/IF(H76>0,(K76/'Summary Stats'!$B$4)^3*(L76/'Summary Stats'!$B$3)^3*MAX((O76-$R$1+1)^2,0.001)*3^B76*IF(LEN(P76)=0,1,IF(P76>=$R$1,P76-$R$1+1,1/($R$1+1-P76))^2),1000000000)","v":2.2546346073395562E-2},95,{"$f":"IF(H76>0,SUMIF(Purchases!$U$3:$U$2002,A76,Purchases!$N$3:$N$2002)/H76,\"\")","v":53.077495405197141},52.32,null,2017,null,209.25,0.50657108721624855,{"$f":"IF(ISNUMBER($Q76),IF(AND(S$1<=$O76,S$1>=$P76),365/$Q76,\"\"),\"\")","v":1.7443249701314218},1.7443249701314218,"","","","","","","","",{"$f":"IF(ISNUMBER($Q76),IF(AND(AC$1<=$O76,AC$1>=$P76),365/$Q76,\"\"),\"\")","v":""},"","","","","","","","","","","","",212.30998162078856,209.28,"Red",null,null,null,null,40305,null,null,95,"Rater 2",null,null,null,null,"AU|","AU||",null,"Shiraz/Syrah",null,false]
["Schloss Lieser | 2010 | Riesling | Riesling Spätlese Mosel Lieser Niederberg Helden | 0.75 L",1,"N","DE",2010,1781.6433027777748,{"$f":"SUMIF(Purchases!$U$3:$U$2002,A77,Purchases!$K$3:$K$2002)+SUMIF('Fully Consumed'!$U$2:$U$2001,A77,'Fully Consumed'!$K$2:$K$2001)","v":9},{"$f":"SUMIF(Purchases!$U$3:$U$2002,A77,Purchases!$M$3:$M$2001)","v":7},0.77777777777777779,{"$f":"10/IF(H77>0,(K77/'Summary Stats'!$B$4)^3*(L77/'Summary Stats'!$B$3)^3*MAX((O77-$R$1+1)^2,0.001)*3^B77*IF(LEN(P77)=0,1,IF(P77>=$R$1,P77-$R$1+1,1/($R$1+1-P77))^2),1000000000)","v":1.9443192670212312E-3},95,{"$f":"IF(H77>0,SUMIF(Purchases!$U$3:$U$2002,A77,Purchases!$N$3:$N$2002)/H77,\"\")","v":32.830784297883511},31.46,null,2035,null,1058.7142857142858,0.10012144110106598,0.34475779247065169,0.34475779247065169,0.34475779247065169,0.34475779247065169,0.34475779247065169,0.34475779247065169,0.34475779247065169,0.34475779247065169,0.34475779247065169,0.34475779247065169,0.34475779247065169,0.34475779247065169,0.34475779247065169,0.34475779247065169,0.34475779247065169,0.34475779247065169,0.34475779247065169,0.34475779247065169,0.34475779247065169,0.34475779247065169,"","","",229.81549008518459,220.22,"White","Mosel",null,null,null,null,null,null,95,"Rater 2",null,null,null,null,"DE|Mosel","DE|Mosel|",null,"Riesling",null,false]
["Turley | 2013 | Zinfandel | Zinfandel Mead Ranch | 0.75 L",1,"N","US",2013,685.64330277777481,{"$f":"SUMIF(Purchases!$U$3:$U$2002,A78,Purchases!$K$3:$K$2002)+SUMIF('Fully Consumed'!$U$2:$U$2001,A78,'Fully Consumed'!$K$2:$K$2001)","v":2},{"$f":"SUMIF(Purchases!$U$3:$U$2002,A78,Purchases!$M$3:$M$2001)","v":2},1,{"$f":"10/IF(H78>0,(K78/'Summary Stats'!$B$4)^3*(L78/'Summary Stats'!$B$3)^3*MAX((O78-$R$1+1)^2,0.001)*3^B78*IF(LEN(P78)=0,1,IF(P78>=$R$1,P78-$R$1+1,1/($R$1+1-P78))^2),1000000000)","v":3.3598886381443751E-3},92,{"$f":"IF(H78>0,SUMIF(Purchases!$U$3:$U$2002,A78,Purchases!$N$3:$N$2002)/H78,\"\")","v":49.699168730735778},48.96,null,2023,null,1514,7.0013210039630125E-2,0.24108322324966974,0.24108322324966974,0.24108322324966974,0.24108322324966974,0.24108322324966974,0.24108322324966974,0.24108322324966974,0.24108322324966974,"","","","","","","","","","","","","","","",99.398337461471556,97.92,"Red","Atlas Peak","Mead Ranch",null,null,null,null,"Turley",92,"Rater 1",null,null,null,null,"US|Atlas Peak","US|Atlas Peak|Mead Ranch",null,"Zinfandel",null,false]
["Symington Family | 2011 | ouriga Franca, Tinta Roriz and Tinta Barroca | Douro Altano | 0.75 L",1,"N","PT",2011,1416.6433027777748,{"$f":"SUMIF(Purchases!$U$3:$U$2002,A79,Purchases!$K$3:$K$2002)+SUMIF('Fully Consumed'!$U$2:$U$2001,A79,'Fully Consumed'!$K$2:$K$2001)","v":24},{"$f":"SUMIF(Purchases!$U$3:$U$2002,A79,Purchases!$M$3:$M$2001)","v":7},0.29166666666666669,{"$f":"10/IF(H79>0,(K79/'Summary Stats'!$B$4)^3*(L79/'Summary Stats'!$B$3)^3*MAX((O79-$R$1+1)^2,0.001)*3^B79*IF(LEN(P79)=0,1,IF(P79>=$R$1,P79-$R$1+1,1/($R$1+1-P79))^2),1000000000)","v":1.1315497838879258},91,{"$f":"IF(H79>0,SUMIF(Purchases!$U$3:$U$2002,A79,Purchases!$N$3:$N$2002)/H79,\"\")","v":10.686306729078293},10.28,null,2019,null,223.85714285714286,0.47351627313337585,1.6305041480536056,1.6305041480536056,1.6305041480536056,1.6305041480536056,"","","","","","","","","","","","","","","","","","","",74.804147103548047,71.959999999999994,"Red",null,null,null,null,null,null,null,91,"Rater 2",null,null,null,null,"PT|","PT||",null,"Touriga Blend",null,false]
["Rex Hill | 2009 | Pinot Noir | Willamette Valley Pinot Noir | 0.75 L",1,"N","US",2009,2146.6433027777748,{"$f":"SUMIF(Purchases!$U$3:$U$2002,A80,Purchases!$K$3:$K$2002)+SUMIF('Fully Consumed'!$U$2:$U$2001,A80,'Fully Consumed'!$K$2:$K$2001)","v":12},{"$f":"SUMIF(Purchases!$U$3:$U$2002,A80,Purchases!$M$3:$M$2001)","v":7},0.58333333333333337,{"$f":"10/IF(H80>0,(K80/'Summary Stats'!$B$4)^3*(L80/'Summary Stats'!$B$3)^3*MAX((O80-$R$1+1)^2,0.001)*3^B80*IF(LEN(P80)=0,1,IF(P80>=$R$1,P80-$R$1+1,1/($R$1+1-P80))^2),1000000000)","v":7.9996495509872104E-2},93,{"$f":"IF(H80>0,SUMIF(Purchases!$U$3:$U$2002,A80,Purchases!$N$3:$N$2002)/H80,\"\")","v":25.288339542984964},24.94,null,2019,null,223.85714285714286,0.47351627313337585,1.6305041480536056,1.6305041480536056,1.6305041480536056,1.6305041480536056,"","","","","","","","","","","","","","","","","","","",177.01837680089474,174.58,"Red",null,null,null,null,null,null,null,93,"Rater 2",null,null,null,null,"US|","US||",null,"Pinot Noir",null,false]
["Schild | 2011 | Shiraz | Barossa | 0.75 L",5,"S","AU",2011,1599.6433027777748,{"$f":"SUMIF(Purchases!$U$3:$U$2002,A81,Purchases!$K$3:$K$2002)+SUMIF('Fully Consumed'!$U$2:$U$2001,A81,'Fully Consumed'!$K$2:$K$2001)","v":12},{"$f":"SUMIF(Purchases!$U$3:$U$2002,A81,Purchases!$M$3:$M$2001)","v":10},0.83333333333333337,{"$f":"10/IF(H81>0,(K81/'Summary Stats'!$B$4)^3*(L81/'Summary Stats'!$B$3)^3*MAX((O81-$R$1+1)^2,0.001)*3^B81*IF(LEN(P81)=0,1,IF(P81>=$R$1,P81-$R$1+1,1/($R$1+1-P81))^2),1000000000)","v":1.924628749004851E-3},90,{"$f":"IF(H81>0,SUMIF(Purchases!$U$3:$U$2002,A81,Purchases!$N$3:$N$2002)/H81,\"\")","v":16.716873425424101},16.670000000000002,null,2021,null,229.8,0.4612706701479547,1.588337684943429,1.588337684943429,1.588337684943429,1.588337684943429,1.588337684943429,1.588337684943429,"","","","","","","","","","","","","","","","","",167.168734254241,166.70000000000002,"Red",null,null,null,null,null,null,null,90,"Rater 2",null,null,null,null,"AU|","AU||",null,"Shiraz/Syrah",null,false]
["Pierre Amadieu | 2010 | Grenache (80), Syrah (20) | Vacqueyras La Grangelière | 0.75 L",1,"N","FR",2010,1781.6433027777748,{"$f":"SUMIF(Purchases!$U$3:$U$2002,A82,Purchases!$K$3:$K$2002)+SUMIF('Fully Consumed'!$U$2:$U$2001,A82,'Fully Consumed'!$K$2:$K$2001)","v":12},{"$f":"SUMIF(Purchases!$U$3:$U$2002,A82,Purchases!$M$3:$M$2001)","v":2},0.16666666666666666,{"$f":"10/IF(H82>0,(K82/'Summary Stats'!$B$4)^3*(L82/'Summary Stats'!$B$3)^3*MAX((O82-$R$1+1)^2,0.001)*3^B82*IF(LEN(P82)=0,1,IF(P82>=$R$1,P82-$R$1+1,1/($R$1+1-P82))^2),1000000000)","v":0.44245105686020314},92,{"$f":"IF(H82>0,SUMIF(Purchases!$U$3:$U$2002,A82,Purchases!$N$3:$N$2002)/H82,\"\")","v":16.773512588560582},15.99,null,2018,null,601,0.17637271214642264,0.60732113144758737,0.60732113144758737,0.60732113144758737,"","","","","","","","","","","","","","","","","","","","",33.547025177121164,31.98,"Red",null,null,null,null,null,null,null,92,"Rater 2",null,null,null,null,"FR|","FR||",null,"Grenache Blend",null,false]
["Marchesi de' Frescobaldi | 2007 | Cab S, Merlot, Cab F, Sangiovese | Tenuta di Castiglioni Toscana Rosso | 0.75 L",1,"N","IT",2007,2877.6433027777748,{"$f":"SUMIF(Purchases!$U$3:$U$2002,A83,Purchases!$K$3:$K$2002)+SUMIF('Fully Consumed'!$U$2:$U$2001,A83,'Fully Consumed'!$K$2:$K$2001)","v":12},{"$f":"SUMIF(Purchases!$U$3:$U$2002,A83,Purchases!$M$3:$M$2001)","v":12},1,{"$f":"10/IF(H83>0,(K83/'Summary Stats'!$B$4)^3*(L83/'Summary Stats'!$B$3)^3*MAX((O83-$R$1+1)^2,0.001)*3^B83*IF(LEN(P83)=0,1,IF(P83>=$R$1,P83-$R$1+1,1/($R$1+1-P83))^2),1000000000)","v":5.7725825794065239E-2},93,{"$f":"IF(H83>0,SUMIF(Purchases!$U$3:$U$2002,A83,Purchases!$N$3:$N$2002)/H83,\"\")","v":19.053389536917212},20.23,null,2023,null,252.33333333333334,0.42007926023778069,1.4464993394980183,1.4464993394980183,1.4464993394980183,1.4464993394980183,1.4464993394980183,1.4464993394980183,1.4464993394980183,1.4464993394980183,"","","","","","","","","","","","","","","",228.64067444300656,242.76,"Red",null,null,null,null,null,null,null,93,"Rater 2",null,null,null,null,"IT|","IT||",null,"Cab S Blend",null,false]
["K Vintners | 2014 | Syrah | Rose | 0.75 L",1,"N","US",2014,320.64330277777481,{"$f":"SUMIF(Purchases!$U$3:$U$2002,A84,Purchases!$K$3:$K$2002)+SUMIF('Fully Consumed'!$U$2:$U$2001,A84,'Fully Consumed'!$K$2:$K$2001)","v":4},{"$f":"SUMIF(Purchases!$U$3:$U$2002,A84,Purchases!$M$3:$M$2001)","v":2},0.5,{"$f":"10/IF(H84>0,(K84/'Summary Stats'!$B$4)^3*(L84/'Summary Stats'!$B$3)^3*MAX((O84-$R$1+1)^2,0.001)*3^B84*IF(LEN(P84)=0,1,IF(P84>=$R$1,P84-$R$1+1,1/($R$1+1-P84))^2),1000000000)","v":0.39987383874051241},90,{"$f":"IF(H84>0,SUMIF(Purchases!$U$3:$U$2002,A84,Purchases!$N$3:$N$2002)/H84,\"\")","v":28.151621556401253},27.27,null,2016,null,236,0.44915254237288138,1.5466101694915255,"","","","","","","","","","","","","","","","","","","","","","",56.303243112802505,54.54,"Rose","Walla Walla Valley",null,null,null,null,null,"K Vintners",90,"Rater 1",null,null,null,null,"US|Walla Walla Valley","US|Walla Walla Valley|",null,"Shiraz/Syrah",null,false]
["Domaine du Vieux Télégraphe | 2005 | Chateauneuf Du Pape | La Crau | 0.75 L",1,"N","FR",2005,3607.6433027777748,{"$f":"SUMIF(Purchases!$U$3:$U$2002,A85,Purchases!$K$3:$K$2002)+SUMIF('Fully Consumed'!$U$2:$U$2001,A85,'Fully Consumed'!$K$2:$K$2001)","v":2},{"$f":"SUMIF(Purchases!$U$3:$U$2002,A85,Purchases!$M$3:$M$2001)","v":1},0.5,{"$f":"10/IF(H85>0,(K85/'Summary Stats'!$B$4)^3*(L85/'Summary Stats'!$B$3)^3*MAX((O85-$R$1+1)^2,0.001)*3^B85*IF(LEN(P85)=0,1,IF(P85>=$R$1,P85-$R$1+1,1/($R$1+1-P85))^2),1000000000)","v":1.7427961913211404E-3},95,{"$f":"IF(H85>0,SUMIF(Purchases!$U$3:$U$2002,A85,Purchases!$N$3:$N$2002)/H85,\"\")","v":46.878338634967804},45,null,2027,null,4489,2.3613276899086655E-2,8.1309868567609717E-2,8.1309868567609717E-2,8.1309868567609717E-2,8.1309868567609717E-2,8.1309868567609717E-2,8.1309868567609717E-2,8.1309868567609717E-2,8.1309868567609717E-2,8.1309868567609717E-2,8.1309868567609717E-2,8.1309868567609717E-2,8.1309868567609717E-2,"","","","","","","","","","","",46.878338634967804,45,"Red",null,null,null,null,40306,null,"2005 Châteauneuf-du-Pape",95,"Rater 2",null,null,null,null,"FR|","FR||",null,"Grenache Blend",null,false]
["Hall | 2006 | Cabernet Sauvignon  | Cabernet Sauvignon Napa Valley | 0.75 L",1,"N","US",2006,3242.6433027777748,{"$f":"SUMIF(Purchases!$U$3:$U$2002,A86,Purchases!$K$3:$K$2002)+SUMIF('Fully Consumed'!$U$2:$U$2001,A86,'Fully Consumed'!$K$2:$K$2001)","v":12},{"$f":"SUMIF(Purchases!$U$3:$U$2002,A86,Purchases!$M$3:$M$2001)","v":8},0.66666666666666663,{"$f":"10/IF(H86>0,(K86/'Summary Stats'!$B$4)^3*(L86/'Summary Stats'!$B$3)^3*MAX((O86-$R$1+1)^2,0.001)*3^B86*IF(LEN(P86)=0,1,IF(P86>=$R$1,P86-$R$1+1,1/($R$1+1-P86))^2),1000000000)","v":3.102337019403726E-2},94,{"$f":"IF(H86>0,SUMIF(Purchases!$U$3:$U$2002,A86,Purchases!$N$3:$N$2002)/H86,\"\")","v":30.381921727895737},29.99,null,2020,null,241.625,0.43869632695292293,{"$f":"IF(ISNUMBER($Q86),IF(AND(S$1<=$O86,S$1>=$P86),365/$Q86,\"\"),\"\")","v":1.5106052767718572},1.5106052767718572,1.5106052767718572,1.5106052767718572,1.5106052767718572,"","","","","",{"$f":"IF(ISNUMBER($Q86),IF(AND(AC$1<=$O86,AC$1>=$P86),365/$Q86,\"\"),\"\")","v":""},"","","","","","","","","","","","",243.05537382316589,239.92,"Red",null,null,null,null,null,null,null,94,"Rater 2",null,null,null,null,"US|","US||",null,"Cab S",null,false]
["Proper Wines | 2011 | Syrah | Proper Syrah | 0.75 L",1,"N","US",2011,1416.6433027777748,{"$f":"SUMIF(Purchases!$U$3:$U$2002,A87,Purchases!$K$3:$K$2002)+SUMIF('Fully Consumed'!$U$2:$U$2001,A87,'Fully Consumed'!$K$2:$K$2001)","v":12},{"$f":"SUMIF(Purchases!$U$3:$U$2002,A87,Purchases!$M$3:$M$2001)","v":9},0.75,{"$f":"10/IF(H87>0,(K87/'Summary Stats'!$B$4)^3*(L87/'Summary Stats'!$B$3)^3*MAX((O87-$R$1+1)^2,0.001)*3^B87*IF(LEN(P87)=0,1,IF(P87>=$R$1,P87-$R$1+1,1/($R$1+1-P87))^2),1000000000)","v":2.6388510933437397E-2},90,{"$f":"IF(H87>0,SUMIF(Purchases!$U$3:$U$2002,A87,Purchases!$N$3:$N$2002)/H87,\"\")","v":30.219974155426023},28.8,null,2021,null,255.33333333333334,0.41514360313315923,1.4295039164490861,1.4295039164490861,1.4295039164490861,1.4295039164490861,1.4295039164490861,1.4295039164490861,"","","","","","","","","","","","","","","","","",271.97976739883421,259.2,"Red","Walla Walla Valley",null,null,null,null,null,"The Rocks of Milton-Freewater",90,"Rater 2",null,null,null,null,"US|Walla Walla Valley","US|Walla Walla Valley|",null,"Shiraz/Syrah","Proper",false]
["San Filippo | 2004 | Brunello | Le Lucere Brunello | 0.75 L",1,"N","IT",2004,3972.6433027777748,{"$f":"SUMIF(Purchases!$U$3:$U$2002,A88,Purchases!$K$3:$K$2002)+SUMIF('Fully Consumed'!$U$2:$U$2001,A88,'Fully Consumed'!$K$2:$K$2001)","v":10},{"$f":"SUMIF(Purchases!$U$3:$U$2002,A88,Purchases!$M$3:$M$2001)","v":5},0.5,{"$f":"10/IF(H88>0,(K88/'Summary Stats'!$B$4)^3*(L88/'Summary Stats'!$B$3)^3*MAX((O88-$R$1+1)^2,0.001)*3^B88*IF(LEN(P88)=0,1,IF(P88>=$R$1,P88-$R$1+1,1/($R$1+1-P88))^2),1000000000)","v":2.2650652052715907E-3},96,{"$f":"IF(H88>0,SUMIF(Purchases!$U$3:$U$2002,A88,Purchases!$N$3:$N$2002)/H88,\"\")","v":47.516778975814582},47.39,null,2025,null,751.8,0.14099494546421923,0.48550146315509446,0.48550146315509446,0.48550146315509446,0.48550146315509446,0.48550146315509446,0.48550146315509446,0.48550146315509446,0.48550146315509446,0.48550146315509446,0.48550146315509446,"","","","","","","","","","","","","",237.58389487907291,236.95,"Red",null,null,null,null,null,null,"2004 Brunello",96,"Rater 2",null,null,null,null,"IT|","IT||",null,"Brunello",null,false]
["Massolino | 2009 | Nebbiolo | Barolo | 0.75 L",1,"N","IT",2009,{"$f":"NOW()-IF(C89=\"N\",DATE(E89,10,31),DATE(E89,4,31))","v":2146.6433027777748},{"$f":"SUMIF(Purchases!$U$3:$U$2002,A89,Purchases!$K$3:$K$2002)+SUMIF('Fully Consumed'!$U$2:$U$2001,A89,'Fully Consumed'!$K$2:$K$2001)","v":12},{"$f":"SUMIF(Purchases!$U$3:$U$2002,A89,Purchases!$M$3:$M$2001)","v":12},{"$f":"H89/G89","v":1},{"$f":"10/IF(H89>0,(K89/'Summary Stats'!$B$4)^3*(L89/'Summary Stats'!$B$3)^3*MAX((O89-$R$1+1)^2,0.001)*3^B89*IF(LEN(P89)=0,1,IF(P89>=$R$1,P89-$R$1+1,1/($R$1+1-P89))^2),1000000000)","v":1.559575999769203E-4},95,{"$f":"IF(H89>0,SUMIF(Purchases!$U$3:$U$2002,A89,Purchases!$N$3:$N$2002)/H89,\"\")","v":40.558818307310347},39.99,null,2032,2017,{"$f":"IF(AND(LEN(O89)>0,H89>0),(DATE(O89,12,31)-MAX(FLOOR(NOW(),1),DATE(P89,1,1)))/H89,\"\")","v":486.91666666666669},{"$f":"IF(R$1<=$O89,IF(AND(ISNUMBER(Q89),R$1>=$P89),(DATE(R$1,12,31)-INT(NOW()))/Q89,\"\"),H89)","v":""},"",0.74961492384049289,0.74961492384049289,0.74961492384049289,0.74961492384049289,0.74961492384049289,0.74961492384049289,0.74961492384049289,0.74961492384049289,0.74961492384049289,0.74961492384049289,0.74961492384049289,0.74961492384049289,0.74961492384049289,0.74961492384049289,0.74961492384049289,0.74961492384049289,"","","","","","",{"$f":"H89*L89","v":486.70581968772416},{"$f":"M89*H89","v":479.88},"Red","Piedmont",null,null,null,null,null,null,95,"Rater 2",null,null,null,null,{"$f":"D89&\"|\"&AS89","v":"IT|Piedmont"},{"$f":"BF89&\"|\"&AT89","v":"IT|Piedmont|"},null,"Nebbiolo",null,false]
["Evening Land Vineyards | 2012 | Pinot Noir | Seven Springs Vineyard, Eola Amity Hills | 0.75 L",1,"N","US",2012,1050.6433027777748,{"$f":"SUMIF(Purchases!$U$3:$U$2002,A90,Purchases!$K$3:$K$2002)+SUMIF('Fully Consumed'!$U$2:$U$2001,A90,'Fully Consumed'!$K$2:$K$2001)","v":6},{"$f":"SUMIF(Purchases!$U$3:$U$2002,A90,Purchases!$M$3:$M$2001)","v":5},0.83333333333333337,{"$f":"10/IF(H90>0,(K90/'Summary Stats'!$B$4)^3*(L90/'Summary Stats'!$B$3)^3*MAX((O90-$R$1+1)^2,0.001)*3^B90*IF(LEN(P90)=0,1,IF(P90>=$R$1,P90-$R$1+1,1/($R$1+1-P90))^2),1000000000)","v":1.3971282086144641E-3},96,{"$f":"IF(H90>0,SUMIF(Purchases!$U$3:$U$2002,A90,Purchases!$N$3:$N$2002)/H90,\"\")","v":69.023494258791203},66.91,null,2022,null,532.6,0.1990236575291025,0.68531731130304163,0.68531731130304163,0.68531731130304163,0.68531731130304163,0.68531731130304163,0.68531731130304163,0.68531731130304163,"","","","","","","","","","","","","","","","",345.11747129395599,334.54999999999995,"Red","Eola Amity Hills","Seven Springs Vineyard",null,null,null,null,null,96,"Rater 2",null,null,null,null,"US|Eola Amity Hills","US|Eola Amity Hills|Seven Springs Vineyard",null,"Pinot Noir",null,false]
["Inniskillin | 2006 | Vidal | Niagara Pennisula Vidal Ice Wine | 0.375 L",1,"N","CA",2006,{"$f":"NOW()-IF(C91=\"N\",DATE(E91,10,31),DATE(E91,4,31))","v":3242.6433027777748},{"$f":"SUMIF(Purchases!$U$3:$U$2002,A91,Purchases!$K$3:$K$2002)+SUMIF('Fully Consumed'!$U$2:$U$2001,A91,'Fully Consumed'!$K$2:$K$2001)","v":3},{"$f":"SUMIF(Purchases!$U$3:$U$2002,A91,Purchases!$M$3:$M$2001)","v":2},{"$f":"H91/G91","v":0.66666666666666663},{"$f":"10/IF(H91>0,(K91/'Summary Stats'!$B$4)^3*(L91/'Summary Stats'!$B$3)^3*MAX((O91-$R$1+1)^2,0.001)*3^B91*IF(LEN(P91)=0,1,IF(P91>=$R$1,P91-$R$1+1,1/($R$1+1-P91))^2),1000000000)","v":4.3862443576862713E-3},91,{"$f":"IF(H91>0,SUMIF(Purchases!$U$3:$U$2002,A91,Purchases!$N$3:$N$2002)/H91,\"\")","v":60.242143929004669},60,null,2020,null,{"$f":"IF(AND(LEN(O91)>0,H91>0),(DATE(O91,12,31)-MAX(FLOOR(NOW(),1),DATE(P91,1,1)))/H91,\"\")","v":966.5},{"$f":"IF(R$1<=$O91,IF(AND(ISNUMBER(Q91),R$1>=$P91),(DATE(R$1,12,31)-INT(NOW()))/Q91,\"\"),H91)","v":0.10967408173823073},0.3776513191929643,0.3776513191929643,0.3776513191929643,0.3776513191929643,0.3776513191929643,"","","","","","","","","","","","","","","","","","",{"$f":"H91*L91","v":120.48428785800934},{"$f":"M91*H91","v":120},"Dessert",null,null,null,null,null,null,null,91,"Rater 2",null,null,null,null,{"$f":"D91&\"|\"&AS91","v":"CA|"},{"$f":"BF91&\"|\"&AT91","v":"CA||"},null,"Vidal",null,false]
["Four Vines | 2011 | Petite Sirah | Petite Sirah Paso Robles Skeptic | 0.75 L",1,"N","US",2011,1416.6433027777748,{"$f":"SUMIF(Purchases!$U$3:$U$2002,A92,Purchases!$K$3:$K$2002)+SUMIF('Fully Consumed'!$U$2:$U$2001,A92,'Fully Consumed'!$K$2:$K$2001)","v":12},{"$f":"SUMIF(Purchases!$U$3:$U$2002,A92,Purchases!$M$3:$M$2001)","v":12},1,{"$f":"10/IF(H92>0,(K92/'Summary Stats'!$B$4)^3*(L92/'Summary Stats'!$B$3)^3*MAX((O92-$R$1+1)^2,0.001)*3^B92*IF(LEN(P92)=0,1,IF(P92>=$R$1,P92-$R$1+1,1/($R$1+1-P92))^2),1000000000)","v":7.2323791879929419E-2},92,{"$f":"IF(H92>0,SUMIF(Purchases!$U$3:$U$2002,A92,Purchases!$N$3:$N$2002)/H92,\"\")","v":14.74816084742546},14.1,null,2026,null,343.66666666666669,0.30843840931134819,1.0620756547041708,1.0620756547041708,1.0620756547041708,1.0620756547041708,1.0620756547041708,1.0620756547041708,1.0620756547041708,1.0620756547041708,1.0620756547041708,1.0620756547041708,1.0620756547041708,"","","","","","","","","","","","",176.97793016910552,169.2,"Red","Paso Robles",null,null,null,null,null,null,92,"Rater 2",null,null,null,null,"US|Paso Robles","US|Paso Robles|",null,"Petite Sirah",null,false]
["Prats & Symington | 2011 | Touriga Nacional & Touriga Franca | Duoro Chryseia | 0.75 L",1,"N","PT",2011,{"$f":"NOW()-IF(C93=\"N\",DATE(E93,10,31),DATE(E93,4,31))","v":1416.6433027777748},{"$f":"SUMIF(Purchases!$U$3:$U$2002,A93,Purchases!$K$3:$K$2002)+SUMIF('Fully Consumed'!$U$2:$U$2001,A93,'Fully Consumed'!$K$2:$K$2001)","v":12},{"$f":"SUMIF(Purchases!$U$3:$U$2002,A93,Purchases!$M$3:$M$2001)","v":5},{"$f":"H93/G93","v":0.41666666666666669},{"$f":"10/IF(H93>0,(K93/'Summary Stats'!$B$4)^3*(L93/'Summary Stats'!$B$3)^3*MAX((O93-$R$1+1)^2,0.001)*3^B93*IF(LEN(P93)=0,1,IF(P93>=$R$1,P93-$R$1+1,1/($R$1+1-P93))^2),1000000000)","v":7.0947453375437293E-4},97,{"$f":"IF(H93>0,SUMIF(Purchases!$U$3:$U$2002,A93,Purchases!$N$3:$N$2002)/H93,\"\")","v":53.93983243808151},51.59,null,2022,2016,{"$f":"IF(AND(LEN(O93)>0,H93>0),(DATE(O93,12,31)-MAX(FLOOR(NOW(),1),DATE(P93,1,1)))/H93,\"\")","v":511.2},{"$f":"IF(R$1<=$O93,IF(AND(ISNUMBER(Q93),R$1>=$P93),(DATE(R$1,12,31)-INT(NOW()))/Q93,\"\"),H93)","v":""},0.7140062597809077,0.7140062597809077,0.7140062597809077,0.7140062597809077,0.7140062597809077,0.7140062597809077,0.7140062597809077,"","","","","","","","","","","","","","","","",{"$f":"H93*L93","v":269.69916219040755},{"$f":"M93*H93","v":257.95000000000005},"Red",null,null,null,null,41712,null,null,97,"Rater 2",null,null,null,null,{"$f":"D93&\"|\"&AS93","v":"PT|"},{"$f":"BF93&\"|\"&AT93","v":"PT||"},null,"Touriga Blend",null,false]
["K Vintners | 2012 | Merlot | Northridge | 0.75 L",1,"N","US",2012,1050.6433027777748,{"$f":"SUMIF(Purchases!$U$3:$U$2002,A94,Purchases!$K$3:$K$2002)+SUMIF('Fully Consumed'!$U$2:$U$2001,A94,'Fully Consumed'!$K$2:$K$2001)","v":4},{"$f":"SUMIF(Purchases!$U$3:$U$2002,A94,Purchases!$M$3:$M$2001)","v":3},0.75,{"$f":"10/IF(H94>0,(K94/'Summary Stats'!$B$4)^3*(L94/'Summary Stats'!$B$3)^3*MAX((O94-$R$1+1)^2,0.001)*3^B94*IF(LEN(P94)=0,1,IF(P94>=$R$1,P94-$R$1+1,1/($R$1+1-P94))^2),1000000000)","v":1.3399446743962833E-2},92,{"$f":"IF(H94>0,SUMIF(Purchases!$U$3:$U$2002,A94,Purchases!$N$3:$N$2002)/H94,\"\")","v":46.374239461898803},45.63,null,2019,null,522.33333333333337,0.20293554562858965,0.69878749202297374,0.69878749202297374,0.69878749202297374,0.69878749202297374,"","","","","","","","","","","","","","","","","","","",139.1227183856964,136.89000000000001,"Red","Washington State",null,null,null,null,null,"K Vintners",92,"Rater 1",null,null,null,null,"US|Washington State","US|Washington State|",null,"Merlot",null,false]

{"sheet":"Shopping List","index":5,"n_rows":1,"n_cols":8,"rows_kept":1,"cut":false,"hidden":false,"merged":[]}
["Winery","Vintage","Varietal","Wine","Btl Sz","Target Price","Rating Score","Potential Vendor"]

{"sheet":"Data Items","index":28,"n_rows":110,"n_cols":137,"rows_kept":110,"cut":false,"hidden":false,"merged":[[21,50,21,55],[18,40,19,40],[18,41,19,41],[18,42,19,42],[18,46,19,46],[18,47,19,47],[18,48,19,48],[18,43,19,43],[18,44,19,44],[18,45,19,45],[18,49,19,49]]}
["# Countries",null,{"$f":"COUNTA(A3:A10002)-1","v":9},null,"# Vintages",{"$f":"COUNTA(E3:E10002)-1","v":12},null,null,null,null,null,"# Varietals",{"$f":"COUNTA(L3:L10002)-1","v":24},null,"# Vendors",{"$f":"COUNTA(O3:O10002)-1","v":76},null,null,"# Wineries",{"$f":"COUNTA(S3:S10002)","v":75},{"$f":"SUM(U2:U10002)","v":587},null,"# Rating Sources",{"$f":"COUNTA(W3:W1002)","v":2},null,"# Special Designations:",{"$f":"COUNTA(Z3:Z1002)","v":12},null,null,"# Bottle Sizes",{"$f":"COUNTA(AD3:AD10002)","v":5},null,null,null,null,"Year:",{"$f":"Inventory!R1","v":2015},{"$f":"Inventory!S1","v":2016},{"$f":"Inventory!T1","v":2017},{"$f":"Inventory!U1","v":2018},{"$f":"Inventory!V1","v":2019},{"$f":"Inventory!W1","v":2020},{"$f":"Inventory!X1","v":2021},{"$f":"Inventory!Y1","v":2022},{"$f":"Inventory!Z1","v":2023},{"$f":"Inventory!AA1","v":2024},{"$f":"Inventory!AB1","v":2025},{"$f":"Inventory!AC1","v":2026},{"$f":"Inventory!AD1","v":2027},{"$f":"Inventory!AE1","v":2028},{"$f":"Inventory!AF1","v":2029},{"$f":"Inventory!AG1","v":2030},{"$f":"Inventory!AH1","v":2031},{"$f":"Inventory!AI1","v":2032},{"$f":"Inventory!AJ1","v":2033},{"$f":"Inventory!AK1","v":2034},{"$f":"Inventory!AL1","v":2035},{"$f":"Inventory!AM1","v":2036},{"$f":"Inventory!AN1","v":2037},{"$f":"Inventory!AO1","v":2038},null,null,"# Closures",{"$f":"COUNTA(BK3:BK10002)-1","v":3},null,"# Colors",{"$f":"COUNTA(BN3:BN10002)-1","v":4},null,"# Regions",null,{"$f":"COUNTA(BQ3:BQ10002)-1","v":11},null,"# Exact Origins",null,{"$f":"COUNTA(BU3:BU10002)-1","v":4},null,"# Custom 1s",{"$f":"COUNTA(BY3:BY10002)-1","v":1},null,"# Custom 2s",{"$f":"COUNTA(CB3:CB10002)-1","v":1},null,null,{"$f":"COUNT(CF3:CF1000)","v":2},1,2,3,4,5,6,7,8,9,10,11,12,13,14,15,16,17,18,19,20,null,null,{"$f":"COUNT(DC3:DC1000)","v":2},1,2,3,null,null,{"$f":"COUNT(DI3:DI1000)","v":2},1,2,3,4,5,6,7,8,9,10,11,12,13,14,15,16,17,18,19,20,null,null,"# Shipping Methods",{"$f":"COUNTA(EF3:EF10002)-1","v":1}]
["Country","Hemisphere","%",null,"Vintage","Blts On-Hand",null,"Score","%","Cmltv %",null,"Varietal","%",null,"Retailer","On-Hand","Total",null,"Producer/Winery","Country","On-Hand",null,"Rating Source","#",null,"Special Designation","# Btls","# Wines",null,"Bottle Size (l)","# Blts",null,null,null,null,"Btls On-Hand:",{"$f":"SUM(Inventory!R2:R1001)","v":49.281465575643757},{"$f":"SUM(Inventory!S2:S1001)","v":94.821492471926391},{"$f":"SUM(Inventory!T2:T1001)","v":85.518141294071967},{"$f":"SUM(Inventory!U2:U1001)","v":71.024560243755886},{"$f":"SUM(Inventory!V2:V1001)","v":68.145114589029447},{"$f":"SUM(Inventory!W2:W1001)","v":55.566939732615943},{"$f":"SUM(Inventory!X2:X1001)","v":30.453127006283825},{"$f":"SUM(Inventory!Y2:Y1001)","v":25.521523353553036},{"$f":"SUM(Inventory!Z2:Z1001)","v":15.898392046832583},{"$f":"SUM(Inventory!AA2:AA1001)","v":12.764310144586878},{"$f":"SUM(Inventory!AB2:AB1001)","v":12.764310144586878},{"$f":"SUM(Inventory!AC2:AC1001)","v":10.628103706704463},{"$f":"SUM(Inventory!AD2:AD1001)","v":9.5660280520002932},{"$f":"SUM(Inventory!AE2:AE1001)","v":7.7772109435128778},{"$f":"SUM(Inventory!AF2:AF1001)","v":7.7772109435128778},{"$f":"SUM(Inventory!AG2:AG1001)","v":7.9675877853436248},{"$f":"SUM(Inventory!AH2:AH1001)","v":3.9810166125593813},{"$f":"SUM(Inventory!AI2:AI1001)","v":3.9810166125593813},{"$f":"SUM(Inventory!AJ2:AJ1001)","v":2.5957145449570138},{"$f":"SUM(Inventory!AK2:AK1001)","v":2.5957145449570138},{"$f":"SUM(Inventory!AL2:AL1001)","v":2.5957145449570138},{"$f":"SUM(Inventory!AM2:AM1001)","v":1.212234319571956},{"$f":"SUM(Inventory!AN2:AN1001)","v":0.54597329127867966},{"$f":"SUM(Inventory!AO2:AO1001)","v":0.54597329127867966},{"$f":"'Summary Stats'!B14","v":587},null,"Closure","%",null,"Color","%",null,"Region","Country","%",null,"Exact Origin","Country|Region","%",null,"Custom Field 1","%",null,"Custom Field 2","%",null,null,"Date","AR","AU","CA","CL","DE","ES","FR","GR","IT","NZ","PT","US","ZA",null,null,null,null,null,null,null,{"$f":"COUNTA(CG2:CZ2)","v":13},null,"Date","Short Hold","Medium Hold","Long Hold",null,null,"Date","2001 Brunello","2004 Brunello","2005 Bordeaux","2005 Châteauneuf-du-Pape","2006 Brunello","2007 Châteauneuf-du-Pape","2010 Brunello","Carlisle","Cayuse","K Vintners","No Girls","Rerynvaan","The Rocks of Milton-Freewater","Turley",null,null,null,null,null,null,{"$f":"COUNTA(DJ2:EC2)","v":14},null,"Shipping Method","%"]
["AR","S",{"$f":"SUMIF(Inventory!$D$2:$D$2001,A3,Inventory!$H$2:$H$2001)/'Summary Stats'!$B$14","v":3.0664395229982964E-2},null,2001,{"$f":"SUMIF(Purchases!$B$3:$B$2002,E3,Purchases!$M$3:$M$2002)","v":1},null,100,{"$f":"SUMIF(Purchases!$Q$3:$Q$2002,H3,Purchases!$M$3:$M$2002)/'Data Items'!$AK$43","v":0},{"$f":"J4+I3","v":1},null,"Aglianico",{"$f":"SUMIF(Purchases!$D$3:$D$2002,L3,Purchases!$M$3:$M$2002)/'Summary Stats'!$B$14","v":1.7035775127768313E-2},null,"Vendor 1",{"$f":"SUMIF(Purchases!$L$3:$L$2002,'Data Items'!O3,Purchases!$M$3:$M$2002)","v":33},{"$f":"SUMIF(Purchases!$L$3:$L$2002,'Data Items'!O3,Purchases!$K$3:$K$2002)+SUMIF('Fully Consumed'!$L$2:$L$2003,'Data Items'!O3,'Fully Consumed'!$K$2:$K$2003)","v":36},null,"Bodegas Marques de Carrion","ES",{"$f":"SUMIF(Purchases!$A$3:$A$2002,'Data Items'!S3,Purchases!$M$3:$M$2002)","v":12},null,"Rater 1",{"$f":"COUNTIF(Inventory!$BA$2:$BA$2001,'Data Items'!W3)","v":8},null,"2001 Brunello",{"$f":"SUMIF(Inventory!$AY$2:$AY$2001,'Data Items'!Z3,Inventory!$H$2:$H$2001)+SUMIF(Inventory!$BJ$2:$BJ$2001,'Data Items'!Z3,Inventory!$H$2:$H$2001)","v":1},{"$f":"COUNTIF(Inventory!$AY$2:$AY$2001,'Data Items'!Z3)+COUNTIF(Inventory!$BJ$2:$BJ$2001,'Data Items'!Z3)","v":1},null,0.20000000298023224,{"$f":"SUMIF(Purchases!$F$3:$F$2002,'Data Items'!AD3,Purchases!$M$3:$M$2002)","v":0},null,null,null,null,"Btls Needed:",{"$f":"(DATE(Inventory!R1,12,31)-NOW())/7*BottlesPerWeek","v":59.757808793352808},{"$f":"365*BottlesPerWeek/7","v":207.02623359165608},207.02623359165608,207.02623359165608,207.02623359165608,207.02623359165608,207.02623359165608,207.02623359165608,207.02623359165608,207.02623359165608,207.02623359165608,207.02623359165608,207.02623359165608,207.02623359165608,207.02623359165608,207.02623359165608,207.02623359165608,207.02623359165608,207.02623359165608,207.02623359165608,207.02623359165608,207.02623359165608,207.02623359165608,207.02623359165608,null,null,"Cork (Natural)",{"$f":"SUMIF(Purchases!$S$3:$S$2001,BK3,Purchases!$M$3:$M$2001)/'Summary Stats'!$B$14","v":6.8143100511073251E-2},null,"Dessert",{"$f":"SUMIF(Inventory!$AR$2:$AR$2001,BN3,Inventory!$H$2:$H$2001)/'Summary Stats'!$B$14","v":1.192504258943782E-2},null,"Atlas Peak","US",{"$f":"SUMIF(Inventory!$BF$2:$BF$2001,BR3&\"|\"&BQ3,Inventory!$H$2:$H$2001)/'Summary Stats'!$B$14","v":3.4071550255536627E-3},null,"Duarte Vineyard","US|Contra Costa County",{"$f":"SUMIF(Inventory!$BG$2:$BG$2001,BV3&\"|\"&BU3,Inventory!$H$2:$H$2001)/'Summary Stats'!$B$14","v":3.4071550255536627E-3},null,"Placeholder (removeable)",{"$f":"SUMIF(Purchases!$D$3:$D$2001,BY3,Purchases!$M$3:$M$2001)/'Summary Stats'!$B$14","v":0},null,"Placeholder (removeable)",{"$f":"SUMIF(Purchases!$D$3:$D$2001,CB3,Purchases!$M$3:$M$2001)/'Summary Stats'!$B$14","v":0},null,null,"2015-07-29",1.1983223259449005E-2,0.12103055417537689,4.1941283270716667E-3,5.9916116297245026E-3,2.6962252333760262E-2,0.11144398152828217,0.1923307329416275,0,0.24385859072208405,0,3.8346316665410995E-2,0.24146194756031036,2.3966447915881872E-3,null,null,null,null,null,null,null,{"$f":"SUM(CG3:CZ3)","v":0.99999998393468559},null,"2015-07-29",0.18274415817855,0.28639904134212102,0.53085680047932904,{"$f":"SUM(DD3:DF3)","v":1},null,"2015-07-29",1,12,78,46,30,9,24,106,0,0,0,0,69,11,null,null,null,null,null,null,null,null,"Placeholder (removeable)",{"$f":"SUMIF(Purchases!$S$3:$S$2001,EF3,Purchases!$M$3:$M$2001)/'Summary Stats'!$B$14","v":0}]
["AU","S",{"$f":"SUMIF(Inventory!$D$2:$D$2001,A4,Inventory!$H$2:$H$2001)/'Summary Stats'!$B$14","v":0.18398637137989779},null,2004,{"$f":"SUMIF(Purchases!$B$3:$B$2002,E4,Purchases!$M$3:$M$2002)","v":49},null,99,{"$f":"SUMIF(Purchases!$Q$3:$Q$2002,H4,Purchases!$M$3:$M$2002)/'Data Items'!$AK$43","v":6.8143100511073255E-3},1,null,"Brunello",{"$f":"SUMIF(Purchases!$D$3:$D$2002,L4,Purchases!$M$3:$M$2002)/'Summary Stats'!$B$14","v":7.1550255536626917E-2},null,"Vendor 2",{"$f":"SUMIF(Purchases!$L$3:$L$2002,'Data Items'!O4,Purchases!$M$3:$M$2002)","v":3},{"$f":"SUMIF(Purchases!$L$3:$L$2002,'Data Items'!O4,Purchases!$K$3:$K$2002)+SUMIF('Fully Consumed'!$L$2:$L$2003,'Data Items'!O4,'Fully Consumed'!$K$2:$K$2003)","v":6},null,"Chateau Monbrison","FR",{"$f":"SUMIF(Purchases!$A$3:$A$2002,'Data Items'!S4,Purchases!$M$3:$M$2002)","v":11},null,"Rater 2",{"$f":"COUNTIF(Inventory!$BA$2:$BA$2001,'Data Items'!W4)","v":85},null,"2004 Brunello",{"$f":"SUMIF(Inventory!$AY$2:$AY$2001,'Data Items'!Z4,Inventory!$H$2:$H$2001)+SUMIF(Inventory!$BJ$2:$BJ$2001,'Data Items'!Z4,Inventory!$H$2:$H$2001)","v":11},{"$f":"COUNTIF(Inventory!$AY$2:$AY$2001,'Data Items'!Z4)+COUNTIF(Inventory!$BJ$2:$BJ$2001,'Data Items'!Z4)","v":2},null,0.375,{"$f":"SUMIF(Purchases!$F$3:$F$2002,'Data Items'!AD4,Purchases!$M$3:$M$2002)","v":3},null,null,null,null,"Surplus/Shortage:",{"$f":"ROUND(AK2-AK3,0)","v":-10},-112,-122,-136,-139,-151,-177,{"$f":"ROUND(AR2-AR3,0)","v":-182},{"$f":"ROUND(AS2-AS3,0)","v":-191},{"$f":"ROUND(AT2-AT3,0)","v":-194},-194,-196,-197,-199,-199,-199,-203,-203,-204,-204,-204,-206,-206,-206,null,null,"Cork (TBD)",{"$f":"SUMIF(Purchases!$S$3:$S$2001,BK4,Purchases!$M$3:$M$2001)/'Summary Stats'!$B$14","v":0.19420783645655879},null,"Red",{"$f":"SUMIF(Inventory!$AR$2:$AR$2001,BN4,Inventory!$H$2:$H$2001)/'Summary Stats'!$B$14","v":0.92674616695059631},null,"Campania","IT",{"$f":"SUMIF(Inventory!$BF$2:$BF$2001,BR4&\"|\"&BQ4,Inventory!$H$2:$H$2001)/'Summary Stats'!$B$14","v":1.7035775127768313E-2},null,"Mead Ranch","US|Atlas Peak",{"$f":"SUMIF(Inventory!$BG$2:$BG$2001,BV4&\"|\"&BU4,Inventory!$H$2:$H$2001)/'Summary Stats'!$B$14","v":3.4071550255536627E-3},null,"Total",{"$f":"SUM(BZ$3:BZ3)","v":0},null,"Total",{"$f":"SUM(CC$3:CC3)","v":0},null,null,"2015-08-23",1.1642157100141048E-2,0.12132352590560913,4.2892158962786198E-3,5.5147060193121433E-3,2.7573529630899429E-2,0.1096813753247261,0.19546568393707275,0,0.24203431606292725,0,3.7377450615167618E-2,0.24325980246067047,1.8382353009656072E-3,null,null,null,null,null,null,null,{"$f":"SUM(CG4:CZ4)","v":0.99999999825377017},null,"2015-08-23",0.17647058823529413,0.28615196078431371,0.53737745098039214,{"$f":"SUM(DD4:DF4)","v":1},null,"2015-08-23",1,11,78,46,30,9,24,105,10,31,17,16,69,10,null,null,null,null,null,null,null,null,"Total",{"$f":"SUM(EG2:EG$3)","v":0}]
["CA","N",{"$f":"SUMIF(Inventory!$D$2:$D$2001,A5,Inventory!$H$2:$H$2001)/'Summary Stats'!$B$14","v":5.1107325383304937E-3},null,2005,{"$f":"SUMIF(Purchases!$B$3:$B$2002,E5,Purchases!$M$3:$M$2002)","v":73},null,98,{"$f":"SUMIF(Purchases!$Q$3:$Q$2002,H5,Purchases!$M$3:$M$2002)/'Data Items'!$AK$43","v":1.192504258943782E-2},0.99318568994889267,null,"Cab S",{"$f":"SUMIF(Purchases!$D$3:$D$2002,L5,Purchases!$M$3:$M$2002)/'Summary Stats'!$B$14","v":2.2146507666098807E-2},null,"Vendor 3",{"$f":"SUMIF(Purchases!$L$3:$L$2002,'Data Items'!O5,Purchases!$M$3:$M$2002)","v":11},{"$f":"SUMIF(Purchases!$L$3:$L$2002,'Data Items'!O5,Purchases!$K$3:$K$2002)+SUMIF('Fully Consumed'!$L$2:$L$2003,'Data Items'!O5,'Fully Consumed'!$K$2:$K$2003)","v":12},null,"Chateau Tanunda","AU",{"$f":"SUMIF(Purchases!$A$3:$A$2002,'Data Items'!S5,Purchases!$M$3:$M$2002)","v":2},null,null,null,null,"2005 Bordeaux",{"$f":"SUMIF(Inventory!$AY$2:$AY$2001,'Data Items'!Z5,Inventory!$H$2:$H$2001)+SUMIF(Inventory!$BJ$2:$BJ$2001,'Data Items'!Z5,Inventory!$H$2:$H$2001)","v":11},{"$f":"COUNTIF(Inventory!$AY$2:$AY$2001,'Data Items'!Z5)+COUNTIF(Inventory!$BJ$2:$BJ$2001,'Data Items'!Z5)","v":1},null,0.5,{"$f":"SUMIF(Purchases!$F$3:$F$2002,'Data Items'!AD5,Purchases!$M$3:$M$2002)","v":3},null,null,null,null,"% of On-Hand:",{"$f":"AK2/$BI$2","v":8.3954796551352226E-2},0.1615357623031114,0.14568678244305275,0.12099584368612587,0.11609048481947094,9.4662588982309948E-2,5.1879262361641948E-2,{"$f":"AR2/$BI$2","v":4.3477893276921697E-2},{"$f":"AS2/$BI$2","v":2.708414318029401E-2},{"$f":"AT2/$BI$2","v":2.174499172842739E-2},2.174499172842739E-2,1.8105798478201811E-2,1.6296470275980055E-2,1.3249081675490422E-2,1.3249081675490422E-2,1.3573403382186754E-2,6.7819703791471573E-3,6.7819703791471573E-3,4.4220009283765143E-3,4.4220009283765143E-3,4.4220009283765143E-3,2.0651351270391076E-3,9.3010782159911362E-4,9.3010782159911362E-4,null,null,"Screwtop",{"$f":"SUMIF(Purchases!$S$3:$S$2001,BK5,Purchases!$M$3:$M$2001)/'Summary Stats'!$B$14","v":0.12095400340715502},null,"Rose",{"$f":"SUMIF(Inventory!$AR$2:$AR$2001,BN5,Inventory!$H$2:$H$2001)/'Summary Stats'!$B$14","v":3.4071550255536627E-3},null,"Contra Costa County","US",{"$f":"SUMIF(Inventory!$BF$2:$BF$2001,BR5&\"|\"&BQ5,Inventory!$H$2:$H$2001)/'Summary Stats'!$B$14","v":3.4071550255536627E-3},null,"Seven Springs Vineyard","US|Eola Amity Hills",{"$f":"SUMIF(Inventory!$BG$2:$BG$2001,BV5&\"|\"&BU5,Inventory!$H$2:$H$2001)/'Summary Stats'!$B$14","v":8.5178875638841564E-3},null,null,null,null,null,null,null,null,null,null,null,null,null,null,null,null,null,null,null,null,null,null,null,null,null,null,null,null,null,{"$f":"SUM(CG5:CZ5)","v":0},null,null,null,null,null,{"$f":"SUM(DD5:DF5)","v":0}]
["DE","N",{"$f":"SUMIF(Inventory!$D$2:$D$2001,A6,Inventory!$H$2:$H$2001)/'Summary Stats'!$B$14","v":1.192504258943782E-2},null,2006,{"$f":"SUMIF(Purchases!$B$3:$B$2002,E6,Purchases!$M$3:$M$2002)","v":26},null,97,{"$f":"SUMIF(Purchases!$Q$3:$Q$2002,H6,Purchases!$M$3:$M$2002)/'Data Items'!$AK$43","v":4.770017035775128E-2},0.98126064735945484,null,"Cab S Blend",{"$f":"SUMIF(Purchases!$D$3:$D$2002,L6,Purchases!$M$3:$M$2002)/'Summary Stats'!$B$14","v":3.9182282793867124E-2},null,"Vendor 4",{"$f":"SUMIF(Purchases!$L$3:$L$2002,'Data Items'!O6,Purchases!$M$3:$M$2002)","v":0},{"$f":"SUMIF(Purchases!$L$3:$L$2002,'Data Items'!O6,Purchases!$K$3:$K$2002)+SUMIF('Fully Consumed'!$L$2:$L$2003,'Data Items'!O6,'Fully Consumed'!$K$2:$K$2003)","v":12},null,"Columbia Crest","US",{"$f":"SUMIF(Purchases!$A$3:$A$2002,'Data Items'!S6,Purchases!$M$3:$M$2002)","v":5},null,null,null,null,"2005 Châteauneuf-du-Pape",{"$f":"SUMIF(Inventory!$AY$2:$AY$2001,'Data Items'!Z6,Inventory!$H$2:$H$2001)+SUMIF(Inventory!$BJ$2:$BJ$2001,'Data Items'!Z6,Inventory!$H$2:$H$2001)","v":16},{"$f":"COUNTIF(Inventory!$AY$2:$AY$2001,'Data Items'!Z6)+COUNTIF(Inventory!$BJ$2:$BJ$2001,'Data Items'!Z6)","v":3},null,0.75,{"$f":"SUMIF(Purchases!$F$3:$F$2002,'Data Items'!AD6,Purchases!$M$3:$M$2002)","v":581},null,null,null,null,null,null,1,2,3,4,5,6,7,8,9,10,11,12,null,null,null,16,17,18,19,20,21,22,23,null,null,"Total",{"$f":"SUM(BL$3:BL5)","v":0.38330494037478702},null,"White",{"$f":"SUMIF(Inventory!$AR$2:$AR$2001,BN6,Inventory!$H$2:$H$2001)/'Summary Stats'!$B$14","v":5.7921635434412269E-2},null,"Eola Amity Hills","US",{"$f":"SUMIF(Inventory!$BF$2:$BF$2001,BR6&\"|\"&BQ6,Inventory!$H$2:$H$2001)/'Summary Stats'!$B$14","v":8.5178875638841564E-3},null,"The Rocks of Milton-Freewater","US|Walla Walla Valley",{"$f":"SUMIF(Inventory!$BG$2:$BG$2001,BV6&\"|\"&BU6,Inventory!$H$2:$H$2001)/'Summary Stats'!$B$14","v":1.8739352640545145E-2}]
["ES","N",{"$f":"SUMIF(Inventory!$D$2:$D$2001,A7,Inventory!$H$2:$H$2001)/'Summary Stats'!$B$14","v":0.10902896081771721},null,2007,{"$f":"SUMIF(Purchases!$B$3:$B$2002,E7,Purchases!$M$3:$M$2002)","v":70},null,96,{"$f":"SUMIF(Purchases!$Q$3:$Q$2002,H7,Purchases!$M$3:$M$2002)/'Data Items'!$AK$43","v":0.10902896081771721},0.93356047700170353,null,"Chenin Blanc",{"$f":"SUMIF(Purchases!$D$3:$D$2002,L7,Purchases!$M$3:$M$2002)/'Summary Stats'!$B$14","v":3.7478705281090291E-2},null,"Vendor 5",{"$f":"SUMIF(Purchases!$L$3:$L$2002,'Data Items'!O7,Purchases!$M$3:$M$2002)","v":0},{"$f":"SUMIF(Purchases!$L$3:$L$2002,'Data Items'!O7,Purchases!$K$3:$K$2002)+SUMIF('Fully Consumed'!$L$2:$L$2003,'Data Items'!O7,'Fully Consumed'!$K$2:$K$2003)","v":12},null,"Condado de Haza","ES",{"$f":"SUMIF(Purchases!$A$3:$A$2002,'Data Items'!S7,Purchases!$M$3:$M$2002)","v":8},null,null,null,null,"2010 Brunello",{"$f":"SUMIF(Inventory!$AY$2:$AY$2001,'Data Items'!Z7,Inventory!$H$2:$H$2001)+SUMIF(Inventory!$BJ$2:$BJ$2001,'Data Items'!Z7,Inventory!$H$2:$H$2001)","v":24},{"$f":"COUNTIF(Inventory!$AY$2:$AY$2001,'Data Items'!Z7)+COUNTIF(Inventory!$BJ$2:$BJ$2001,'Data Items'!Z7)","v":2},null,1.5,{"$f":"SUMIF(Purchases!$F$3:$F$2002,'Data Items'!AD7,Purchases!$M$3:$M$2002)","v":0},null,null,null,null,"Net Needed",{"$f":"-AK4","v":10},{"$f":"-AL4","v":112},122,136,139,151,177,182,191,194,194,196,197,199,199,199,203,203,204,204,204,206,206,206,null,null,null,null,null,"Total",{"$f":"SUM(BO$3:BO6)","v":1},null,"Maipo Valley","AR",{"$f":"SUMIF(Inventory!$BF$2:$BF$2001,BR7&\"|\"&BQ7,Inventory!$H$2:$H$2001)/'Summary Stats'!$B$14","v":3.0664395229982964E-2},null,"Total",null,{"$f":"SUM(BW$3:BW6)","v":3.4071550255536626E-2}]
["FR","N",{"$f":"SUMIF(Inventory!$D$2:$D$2001,A8,Inventory!$H$2:$H$2001)/'Summary Stats'!$B$14","v":0.16524701873935263},null,2008,{"$f":"SUMIF(Purchases!$B$3:$B$2002,E8,Purchases!$M$3:$M$2002)","v":55},null,95,{"$f":"SUMIF(Purchases!$Q$3:$Q$2002,H8,Purchases!$M$3:$M$2002)/'Data Items'!$AK$43","v":0.17717206132879046},0.82453151618398635,null,"Grenache",{"$f":"SUMIF(Purchases!$D$3:$D$2002,L8,Purchases!$M$3:$M$2002)/'Summary Stats'!$B$14","v":1.192504258943782E-2},null,"Vendor 6",{"$f":"SUMIF(Purchases!$L$3:$L$2002,'Data Items'!O8,Purchases!$M$3:$M$2002)","v":0},{"$f":"SUMIF(Purchases!$L$3:$L$2002,'Data Items'!O8,Purchases!$K$3:$K$2002)+SUMIF('Fully Consumed'!$L$2:$L$2003,'Data Items'!O8,'Fully Consumed'!$K$2:$K$2003)","v":24},null,"Corrina Rayment","AU",{"$f":"SUMIF(Purchases!$A$3:$A$2002,'Data Items'!S8,Purchases!$M$3:$M$2002)","v":4},null,null,null,null,"K Vintners",{"$f":"SUMIF(Inventory!$AY$2:$AY$2001,'Data Items'!Z8,Inventory!$H$2:$H$2001)+SUMIF(Inventory!$BJ$2:$BJ$2001,'Data Items'!Z8,Inventory!$H$2:$H$2001)","v":17},{"$f":"COUNTIF(Inventory!$AY$2:$AY$2001,'Data Items'!Z8)+COUNTIF(Inventory!$BJ$2:$BJ$2001,'Data Items'!Z8)","v":7},null,null,null,null,null,null,null,"Year:",{"$f":"Inventory!R1","v":2015},{"$f":"Inventory!S1","v":2016},{"$f":"Inventory!T1","v":2017},{"$f":"Inventory!U1","v":2018},{"$f":"Inventory!V1","v":2019},{"$f":"Inventory!W1","v":2020},{"$f":"Inventory!X1","v":2021},{"$f":"Inventory!Y1","v":2022},{"$f":"Inventory!Z1","v":2023},{"$f":"Inventory!AA1","v":2024},{"$f":"Inventory!AB1","v":2025},{"$f":"Inventory!AC1","v":2026},{"$f":"Inventory!AD1","v":2027},{"$f":"Inventory!AE1","v":2028},{"$f":"Inventory!AF1","v":2029},{"$f":"Inventory!AG1","v":2030},{"$f":"Inventory!AH1","v":2031},{"$f":"Inventory!AI1","v":2032},{"$f":"Inventory!AJ1","v":2033},{"$f":"Inventory!AK1","v":2034},{"$f":"Inventory!AL1","v":2035},{"$f":"Inventory!AM1","v":2036},{"$f":"Inventory!AN1","v":2037},{"$f":"Inventory!AO1","v":2038},null,null,null,null,null,null,null,null,"Mosel","DE",{"$f":"SUMIF(Inventory!$BF$2:$BF$2001,BR8&\"|\"&BQ8,Inventory!$H$2:$H$2001)/'Summary Stats'!$B$14","v":1.192504258943782E-2}]
["IT","N",{"$f":"SUMIF(Inventory!$D$2:$D$2001,A9,Inventory!$H$2:$H$2001)/'Summary Stats'!$B$14","v":0.26916524701873934},null,2009,{"$f":"SUMIF(Purchases!$B$3:$B$2002,E9,Purchases!$M$3:$M$2002)","v":86},null,94,{"$f":"SUMIF(Purchases!$Q$3:$Q$2002,H9,Purchases!$M$3:$M$2002)/'Data Items'!$AK$43","v":8.8586030664395229E-2},0.64735945485519586,null,"Grenache Blend",{"$f":"SUMIF(Purchases!$D$3:$D$2002,L9,Purchases!$M$3:$M$2002)/'Summary Stats'!$B$14","v":7.3253833049403749E-2},null,"Vendor 7",{"$f":"SUMIF(Purchases!$L$3:$L$2002,'Data Items'!O9,Purchases!$M$3:$M$2002)","v":5},{"$f":"SUMIF(Purchases!$L$3:$L$2002,'Data Items'!O9,Purchases!$K$3:$K$2002)+SUMIF('Fully Consumed'!$L$2:$L$2003,'Data Items'!O9,'Fully Consumed'!$K$2:$K$2003)","v":53},null,"d'Arenberg","AU",{"$f":"SUMIF(Purchases!$A$3:$A$2002,'Data Items'!S9,Purchases!$M$3:$M$2002)","v":1},null,null,null,null,"Limerick Lane",{"$f":"SUMIF(Inventory!$AY$2:$AY$2001,'Data Items'!Z9,Inventory!$H$2:$H$2001)+SUMIF(Inventory!$BJ$2:$BJ$2001,'Data Items'!Z9,Inventory!$H$2:$H$2001)","v":1},{"$f":"COUNTIF(Inventory!$AY$2:$AY$2001,'Data Items'!Z9)+COUNTIF(Inventory!$BJ$2:$BJ$2001,'Data Items'!Z9)","v":1},null,null,null,null,null,null,null,{"$f":"IF(ROW(AI9)-8<=WineColorCount,BN3,\"\")","v":"Dessert"},{"$f":"IF(ROW(AI9)-8<=WineColorCount,SUMIF(Inventory!$AR$2:$AR$1001,$AJ9,Inventory!R2:R1001),\"\")","v":1.1096740817382307},{"$f":"IF(ROW(AJ9)-8<=WineColorCount,SUMIF(Inventory!$AR$2:$AR$1001,$AJ9,Inventory!S2:S1001),\"\")","v":0.3776513191929643},{"$f":"IF(ROW(AK9)-8<=WineColorCount,SUMIF(Inventory!$AR$2:$AR$1001,$AJ9,Inventory!T2:T1001),\"\")","v":0.3776513191929643},{"$f":"IF(ROW(AL9)-8<=WineColorCount,SUMIF(Inventory!$AR$2:$AR$1001,$AJ9,Inventory!U2:U1001),\"\")","v":0.3776513191929643},{"$f":"IF(ROW(AM9)-8<=WineColorCount,SUMIF(Inventory!$AR$2:$AR$1001,$AJ9,Inventory!V2:V1001),\"\")","v":0.3776513191929643},{"$f":"IF(ROW(AN9)-8<=WineColorCount,SUMIF(Inventory!$AR$2:$AR$1001,$AJ9,Inventory!W2:W1001),\"\")","v":0.3776513191929643},{"$f":"IF(ROW(AO9)-8<=WineColorCount,SUMIF(Inventory!$AR$2:$AR$1001,$AJ9,Inventory!X2:X1001),\"\")","v":0},{"$f":"IF(ROW(AP9)-8<=WineColorCount,SUMIF(Inventory!$AR$2:$AR$1001,$AJ9,Inventory!Y2:Y1001),\"\")","v":0},{"$f":"IF(ROW(AQ9)-8<=WineColorCount,SUMIF(Inventory!$AR$2:$AR$1001,$AJ9,Inventory!Z2:Z1001),\"\")","v":0},{"$f":"IF(ROW(AR9)-8<=WineColorCount,SUMIF(Inventory!$AR$2:$AR$1001,$AJ9,Inventory!AA2:AA1001),\"\")","v":0},{"$f":"IF(ROW(AS9)-8<=WineColorCount,SUMIF(Inventory!$AR$2:$AR$1001,$AJ9,Inventory!AB2:AB1001),\"\")","v":0},{"$f":"IF(ROW(AT9)-8<=WineColorCount,SUMIF(Inventory!$AR$2:$AR$1001,$AJ9,Inventory!AC2:AC1001),\"\")","v":0},{"$f":"IF(ROW(AU9)-8<=WineColorCount,SUMIF(Inventory!$AR$2:$AR$1001,$AJ9,Inventory!AD2:AD1001),\"\")","v":0},{"$f":"IF(ROW(AV9)-8<=WineColorCount,SUMIF(Inventory!$AR$2:$AR$1001,$AJ9,Inventory!AE2:AE1001),\"\")","v":0},{"$f":"IF(ROW(AW9)-8<=WineColorCount,SUMIF(Inventory!$AR$2:$AR$1001,$AJ9,Inventory!AF2:AF1001),\"\")","v":0},{"$f":"IF(ROW(AX9)-8<=WineColorCount,SUMIF(Inventory!$AR$2:$AR$1001,$AJ9,Inventory!AG2:AG1001),\"\")","v":0.19037684183074716},{"$f":"IF(ROW(AY9)-8<=WineColorCount,SUMIF(Inventory!$AR$2:$AR$1001,$AJ9,Inventory!AH2:AH1001),\"\")","v":0.19037684183074716},{"$f":"IF(ROW(AZ9)-8<=WineColorCount,SUMIF(Inventory!$AR$2:$AR$1001,$AJ9,Inventory!AI2:AI1001),\"\")","v":0.19037684183074716},{"$f":"IF(ROW(BA9)-8<=WineColorCount,SUMIF(Inventory!$AR$2:$AR$1001,$AJ9,Inventory!AJ2:AJ1001),\"\")","v":0.19037684183074716},{"$f":"IF(ROW(BB9)-8<=WineColorCount,SUMIF(Inventory!$AR$2:$AR$1001,$AJ9,Inventory!AK2:AK1001),\"\")","v":0.19037684183074716},{"$f":"IF(ROW(BC9)-8<=WineColorCount,SUMIF(Inventory!$AR$2:$AR$1001,$AJ9,Inventory!AL2:AL1001),\"\")","v":0.19037684183074716},{"$f":"IF(ROW(BD9)-8<=WineColorCount,SUMIF(Inventory!$AR$2:$AR$1001,$AJ9,Inventory!AM2:AM1001),\"\")","v":0.19037684183074716},{"$f":"IF(ROW(BE9)-8<=WineColorCount,SUMIF(Inventory!$AR$2:$AR$1001,$AJ9,Inventory!AN2:AN1001),\"\")","v":0.19037684183074716},{"$f":"IF(ROW(BF9)-8<=WineColorCount,SUMIF(Inventory!$AR$2:$AR$1001,$AJ9,Inventory!AO2:AO1001),\"\")","v":0.19037684183074716},null,null,null,null,null,null,null,null,"Paso Robles","US",{"$f":"SUMIF(Inventory!$BF$2:$BF$2001,BR9&\"|\"&BQ9,Inventory!$H$2:$H$2001)/'Summary Stats'!$B$14","v":2.0442930153321975E-2}]
["PT","N",{"$f":"SUMIF(Inventory!$D$2:$D$2001,A10,Inventory!$H$2:$H$2001)/'Summary Stats'!$B$14","v":3.4071550255536626E-2},null,2010,{"$f":"SUMIF(Purchases!$B$3:$B$2002,E10,Purchases!$M$3:$M$2002)","v":95},null,93,{"$f":"SUMIF(Purchases!$Q$3:$Q$2002,H10,Purchases!$M$3:$M$2002)/'Data Items'!$AK$43","v":0.17376490630323679},0.55877342419080067,null,"Mencia",{"$f":"SUMIF(Purchases!$D$3:$D$2002,L10,Purchases!$M$3:$M$2002)/'Summary Stats'!$B$14","v":3.4071550255536626E-2},null,"Vendor 8",{"$f":"SUMIF(Purchases!$L$3:$L$2002,'Data Items'!O10,Purchases!$M$3:$M$2002)","v":0},{"$f":"SUMIF(Purchases!$L$3:$L$2002,'Data Items'!O10,Purchases!$K$3:$K$2002)+SUMIF('Fully Consumed'!$L$2:$L$2003,'Data Items'!O10,'Fully Consumed'!$K$2:$K$2003)","v":11},null,"Denner","US",{"$f":"SUMIF(Purchases!$A$3:$A$2002,'Data Items'!S10,Purchases!$M$3:$M$2002)","v":5},null,null,null,null,"No Girls",{"$f":"SUMIF(Inventory!$AY$2:$AY$2001,'Data Items'!Z10,Inventory!$H$2:$H$2001)+SUMIF(Inventory!$BJ$2:$BJ$2001,'Data Items'!Z10,Inventory!$H$2:$H$2001)","v":8},{"$f":"COUNTIF(Inventory!$AY$2:$AY$2001,'Data Items'!Z10)+COUNTIF(Inventory!$BJ$2:$BJ$2001,'Data Items'!Z10)","v":4},null,null,null,null,null,null,null,"Red",{"$f":"IF(ROW(AI10)-8<=WineColorCount,SUMIF(Inventory!$AR$2:$AR$1001,$AJ10,Inventory!R3:R1002),\"\")","v":46.62189873619478},{"$f":"IF(ROW(AJ10)-8<=WineColorCount,SUMIF(Inventory!$AR$2:$AR$1001,$AJ10,Inventory!S3:S1002),\"\")","v":89.106946279484163},{"$f":"IF(ROW(AK10)-8<=WineColorCount,SUMIF(Inventory!$AR$2:$AR$1001,$AJ10,Inventory!T3:T1002),\"\")","v":79.803595101629753},{"$f":"IF(ROW(AL10)-8<=WineColorCount,SUMIF(Inventory!$AR$2:$AR$1001,$AJ10,Inventory!U3:U1002),\"\")","v":65.310014051313672},{"$f":"IF(ROW(AM10)-8<=WineColorCount,SUMIF(Inventory!$AR$2:$AR$1001,$AJ10,Inventory!V3:V1002),\"\")","v":63.037889528034832},15,{"$f":"IF(ROW(AO10)-8<=WineColorCount,SUMIF(Inventory!$AR$2:$AR$1001,$AJ10,Inventory!X3:X1002),\"\")","v":27.611809860446979},{"$f":"IF(ROW(AP10)-8<=WineColorCount,SUMIF(Inventory!$AR$2:$AR$1001,$AJ10,Inventory!Y3:Y1002),\"\")","v":22.680206207716189},{"$f":"IF(ROW(AQ10)-8<=WineColorCount,SUMIF(Inventory!$AR$2:$AR$1001,$AJ10,Inventory!Z3:Z1002),\"\")","v":13.468265287777561},{"$f":"IF(ROW(AR10)-8<=WineColorCount,SUMIF(Inventory!$AR$2:$AR$1001,$AJ10,Inventory!AA3:AA1002),\"\")","v":10.575266608781526},3.3995792865753174,2.7,{"$f":"IF(ROW(AU10)-8<=WineColorCount,SUMIF(Inventory!$AR$2:$AR$1001,$AJ10,Inventory!AD3:AD1002),\"\")","v":8.4390601708991095},{"$f":"IF(ROW(AV10)-8<=WineColorCount,SUMIF(Inventory!$AR$2:$AR$1001,$AJ10,Inventory!AE3:AE1002),\"\")","v":6.7315529309793058},{"$f":"IF(ROW(AW10)-8<=WineColorCount,SUMIF(Inventory!$AR$2:$AR$1001,$AJ10,Inventory!AF3:AF1002),\"\")","v":6.7315529309793058},{"$f":"IF(ROW(AX10)-8<=WineColorCount,SUMIF(Inventory!$AR$2:$AR$1001,$AJ10,Inventory!AG3:AG1002),\"\")","v":6.9219297728100528},{"$f":"IF(ROW(AY10)-8<=WineColorCount,SUMIF(Inventory!$AR$2:$AR$1001,$AJ10,Inventory!AH3:AH1002),\"\")","v":3.9810166125593813},{"$f":"IF(ROW(AZ10)-8<=WineColorCount,SUMIF(Inventory!$AR$2:$AR$1001,$AJ10,Inventory!AI3:AI1002),\"\")","v":3.9810166125593813},{"$f":"IF(ROW(BA10)-8<=WineColorCount,SUMIF(Inventory!$AR$2:$AR$1001,$AJ10,Inventory!AJ3:AJ1002),\"\")","v":2.5957145449570138},{"$f":"IF(ROW(BB10)-8<=WineColorCount,SUMIF(Inventory!$AR$2:$AR$1001,$AJ10,Inventory!AK3:AK1002),\"\")","v":2.5957145449570138},{"$f":"IF(ROW(BC10)-8<=WineColorCount,SUMIF(Inventory!$AR$2:$AR$1001,$AJ10,Inventory!AL3:AL1002),\"\")","v":2.5957145449570138},{"$f":"IF(ROW(BD10)-8<=WineColorCount,SUMIF(Inventory!$AR$2:$AR$1001,$AJ10,Inventory!AM3:AM1002),\"\")","v":1.212234319571956},{"$f":"IF(ROW(BE10)-8<=WineColorCount,SUMIF(Inventory!$AR$2:$AR$1001,$AJ10,Inventory!AN3:AN1002),\"\")","v":0.54597329127867966},{"$f":"IF(ROW(BF10)-8<=WineColorCount,SUMIF(Inventory!$AR$2:$AR$1001,$AJ10,Inventory!AO3:AO1002),\"\")","v":0.54597329127867966},null,null,null,null,null,null,null,null,"Piedmont","IT",{"$f":"SUMIF(Inventory!$BF$2:$BF$2001,BR10&\"|\"&BQ10,Inventory!$H$2:$H$2001)/'Summary Stats'!$B$14","v":2.0442930153321975E-2}]
["US","N",{"$f":"SUMIF(Inventory!$D$2:$D$2001,A11,Inventory!$H$2:$H$2001)/'Summary Stats'!$B$14","v":0.19080068143100512},null,2011,{"$f":"SUMIF(Purchases!$B$3:$B$2002,E11,Purchases!$M$3:$M$2002)","v":75},null,92,{"$f":"SUMIF(Purchases!$Q$3:$Q$2002,H11,Purchases!$M$3:$M$2002)/'Data Items'!$AK$43","v":0.22316865417376491},0.38500851788756385,null,"Merlot",{"$f":"SUMIF(Purchases!$D$3:$D$2002,L11,Purchases!$M$3:$M$2002)/'Summary Stats'!$B$14","v":5.1107325383304937E-3},null,"Vendor 9",{"$f":"SUMIF(Purchases!$L$3:$L$2002,'Data Items'!O11,Purchases!$M$3:$M$2002)","v":0},{"$f":"SUMIF(Purchases!$L$3:$L$2002,'Data Items'!O11,Purchases!$K$3:$K$2002)+SUMIF('Fully Consumed'!$L$2:$L$2003,'Data Items'!O11,'Fully Consumed'!$K$2:$K$2003)","v":24},null,"Domaine de Beaurenard","FR",{"$f":"SUMIF(Purchases!$A$3:$A$2002,'Data Items'!S11,Purchases!$M$3:$M$2002)","v":11},null,null,null,null,"Proper",{"$f":"SUMIF(Inventory!$AY$2:$AY$2001,'Data Items'!Z11,Inventory!$H$2:$H$2001)+SUMIF(Inventory!$BJ$2:$BJ$2001,'Data Items'!Z11,Inventory!$H$2:$H$2001)","v":9},{"$f":"COUNTIF(Inventory!$AY$2:$AY$2001,'Data Items'!Z11)+COUNTIF(Inventory!$BJ$2:$BJ$2001,'Data Items'!Z11)","v":1},null,null,null,null,null,null,null,"Rose",{"$f":"IF(ROW(AI11)-8<=WineColorCount,SUMIF(Inventory!$AR$2:$AR$1001,$AJ11,Inventory!R4:R1003),\"\")","v":0.43869632695292293},{"$f":"IF(ROW(AJ11)-8<=WineColorCount,SUMIF(Inventory!$AR$2:$AR$1001,$AJ11,Inventory!S4:S1003),\"\")","v":1.5106052767718572},{"$f":"IF(ROW(AK11)-8<=WineColorCount,SUMIF(Inventory!$AR$2:$AR$1001,$AJ11,Inventory!T4:T1003),\"\")","v":1.5106052767718572},{"$f":"IF(ROW(AL11)-8<=WineColorCount,SUMIF(Inventory!$AR$2:$AR$1001,$AJ11,Inventory!U4:U1003),\"\")","v":1.5106052767718572},{"$f":"IF(ROW(AM11)-8<=WineColorCount,SUMIF(Inventory!$AR$2:$AR$1001,$AJ11,Inventory!V4:V1003),\"\")","v":1.5106052767718572},0,{"$f":"IF(ROW(AO11)-8<=WineColorCount,SUMIF(Inventory!$AR$2:$AR$1001,$AJ11,Inventory!X4:X1003),\"\")","v":0},{"$f":"IF(ROW(AP11)-8<=WineColorCount,SUMIF(Inventory!$AR$2:$AR$1001,$AJ11,Inventory!Y4:Y1003),\"\")","v":0},{"$f":"IF(ROW(AQ11)-8<=WineColorCount,SUMIF(Inventory!$AR$2:$AR$1001,$AJ11,Inventory!Z4:Z1003),\"\")","v":0},{"$f":"IF(ROW(AR11)-8<=WineColorCount,SUMIF(Inventory!$AR$2:$AR$1001,$AJ11,Inventory!AA4:AA1003),\"\")","v":0},0,0,{"$f":"IF(ROW(AU11)-8<=WineColorCount,SUMIF(Inventory!$AR$2:$AR$1001,$AJ11,Inventory!AD4:AD1003),\"\")","v":0},{"$f":"IF(ROW(AV11)-8<=WineColorCount,SUMIF(Inventory!$AR$2:$AR$1001,$AJ11,Inventory!AE4:AE1003),\"\")","v":0},{"$f":"IF(ROW(AW11)-8<=WineColorCount,SUMIF(Inventory!$AR$2:$AR$1001,$AJ11,Inventory!AF4:AF1003),\"\")","v":0},{"$f":"IF(ROW(AX11)-8<=WineColorCount,SUMIF(Inventory!$AR$2:$AR$1001,$AJ11,Inventory!AG4:AG1003),\"\")","v":0},{"$f":"IF(ROW(AY11)-8<=WineColorCount,SUMIF(Inventory!$AR$2:$AR$1001,$AJ11,Inventory!AH4:AH1003),\"\")","v":0},{"$f":"IF(ROW(AZ11)-8<=WineColorCount,SUMIF(Inventory!$AR$2:$AR$1001,$AJ11,Inventory!AI4:AI1003),\"\")","v":0},{"$f":"IF(ROW(BA11)-8<=WineColorCount,SUMIF(Inventory!$AR$2:$AR$1001,$AJ11,Inventory!AJ4:AJ1003),\"\")","v":0},{"$f":"IF(ROW(BB11)-8<=WineColorCount,SUMIF(Inventory!$AR$2:$AR$1001,$AJ11,Inventory!AK4:AK1003),\"\")","v":0},{"$f":"IF(ROW(BC11)-8<=WineColorCount,SUMIF(Inventory!$AR$2:$AR$1001,$AJ11,Inventory!AL4:AL1003),\"\")","v":0},{"$f":"IF(ROW(BD11)-8<=WineColorCount,SUMIF(Inventory!$AR$2:$AR$1001,$AJ11,Inventory!AM4:AM1003),\"\")","v":0},{"$f":"IF(ROW(BE11)-8<=WineColorCount,SUMIF(Inventory!$AR$2:$AR$1001,$AJ11,Inventory!AN4:AN1003),\"\")","v":0},{"$f":"IF(ROW(BF11)-8<=WineColorCount,SUMIF(Inventory!$AR$2:$AR$1001,$AJ11,Inventory!AO4:AO1003),\"\")","v":0},null,null,null,null,null,null,null,null,"Russian River Valley","US",{"$f":"SUMIF(Inventory!$BF$2:$BF$2001,BR11&\"|\"&BQ11,Inventory!$H$2:$H$2001)/'Summary Stats'!$B$14","v":1.7035775127768314E-3}]
["Total",null,{"$f":"SUM(C$3:C11)","v":1},null,2012,{"$f":"SUMIF(Purchases!$B$3:$B$2002,E12,Purchases!$M$3:$M$2002)","v":47},null,91,{"$f":"SUMIF(Purchases!$Q$3:$Q$2002,H12,Purchases!$M$3:$M$2002)/'Data Items'!$AK$43","v":0.11754684838160136},0.16183986371379896,null,"Merlot Blend",{"$f":"SUMIF(Purchases!$D$3:$D$2002,L12,Purchases!$M$3:$M$2002)/'Summary Stats'!$B$14","v":1.7035775127768313E-2},null,"Vendor 10",{"$f":"SUMIF(Purchases!$L$3:$L$2002,'Data Items'!O12,Purchases!$M$3:$M$2002)","v":10},{"$f":"SUMIF(Purchases!$L$3:$L$2002,'Data Items'!O12,Purchases!$K$3:$K$2002)+SUMIF('Fully Consumed'!$L$2:$L$2003,'Data Items'!O12,'Fully Consumed'!$K$2:$K$2003)","v":12},null,"Domaine des Baumard","FR",{"$f":"SUMIF(Purchases!$A$3:$A$2002,'Data Items'!S12,Purchases!$M$3:$M$2002)","v":7},null,null,null,null,"Reynvaan",{"$f":"SUMIF(Inventory!$AY$2:$AY$2001,'Data Items'!Z12,Inventory!$H$2:$H$2001)+SUMIF(Inventory!$BJ$2:$BJ$2001,'Data Items'!Z12,Inventory!$H$2:$H$2001)","v":5},{"$f":"COUNTIF(Inventory!$AY$2:$AY$2001,'Data Items'!Z12)+COUNTIF(Inventory!$BJ$2:$BJ$2001,'Data Items'!Z12)","v":3},null,null,null,null,null,null,null,"White",{"$f":"IF(ROW(AI12)-8<=WineColorCount,SUMIF(Inventory!$AR$2:$AR$1001,$AJ12,Inventory!R5:R1004),\"\")","v":5.5482440237905291},{"$f":"IF(ROW(AJ12)-8<=WineColorCount,SUMIF(Inventory!$AR$2:$AR$1001,$AJ12,Inventory!S5:S1004),\"\")","v":5.3312176290900304},{"$f":"IF(ROW(AK12)-8<=WineColorCount,SUMIF(Inventory!$AR$2:$AR$1001,$AJ12,Inventory!T5:T1004),\"\")","v":5.3312176290900304},{"$f":"IF(ROW(AL12)-8<=WineColorCount,SUMIF(Inventory!$AR$2:$AR$1001,$AJ12,Inventory!U5:U1004),\"\")","v":5.3312176290900304},{"$f":"IF(ROW(AM12)-8<=WineColorCount,SUMIF(Inventory!$AR$2:$AR$1001,$AJ12,Inventory!V5:V1004),\"\")","v":6.0367588662034315},2,{"$f":"IF(ROW(AO12)-8<=WineColorCount,SUMIF(Inventory!$AR$2:$AR$1001,$AJ12,Inventory!X5:X1004),\"\")","v":4.4062547181498264},{"$f":"IF(ROW(AP12)-8<=WineColorCount,SUMIF(Inventory!$AR$2:$AR$1001,$AJ12,Inventory!Y5:Y1004),\"\")","v":4.4062547181498264},{"$f":"IF(ROW(AQ12)-8<=WineColorCount,SUMIF(Inventory!$AR$2:$AR$1001,$AJ12,Inventory!Z5:Z1004),\"\")","v":0.705541237113402},{"$f":"IF(ROW(AR12)-8<=WineColorCount,SUMIF(Inventory!$AR$2:$AR$1001,$AJ12,Inventory!AA5:AA1004),\"\")","v":0.705541237113402},0,0,{"$f":"IF(ROW(AU12)-8<=WineColorCount,SUMIF(Inventory!$AR$2:$AR$1001,$AJ12,Inventory!AD5:AD1004),\"\")","v":0.705541237113402},{"$f":"IF(ROW(AV12)-8<=WineColorCount,SUMIF(Inventory!$AR$2:$AR$1001,$AJ12,Inventory!AE5:AE1004),\"\")","v":0.705541237113402},{"$f":"IF(ROW(AW12)-8<=WineColorCount,SUMIF(Inventory!$AR$2:$AR$1001,$AJ12,Inventory!AF5:AF1004),\"\")","v":0.705541237113402},{"$f":"IF(ROW(AX12)-8<=WineColorCount,SUMIF(Inventory!$AR$2:$AR$1001,$AJ12,Inventory!AG5:AG1004),\"\")","v":0.705541237113402},{"$f":"IF(ROW(AY12)-8<=WineColorCount,SUMIF(Inventory!$AR$2:$AR$1001,$AJ12,Inventory!AH5:AH1004),\"\")","v":0.705541237113402},{"$f":"IF(ROW(AZ12)-8<=WineColorCount,SUMIF(Inventory!$AR$2:$AR$1001,$AJ12,Inventory!AI5:AI1004),\"\")","v":0.705541237113402},{"$f":"IF(ROW(BA12)-8<=WineColorCount,SUMIF(Inventory!$AR$2:$AR$1001,$AJ12,Inventory!AJ5:AJ1004),\"\")","v":0.705541237113402},{"$f":"IF(ROW(BB12)-8<=WineColorCount,SUMIF(Inventory!$AR$2:$AR$1001,$AJ12,Inventory!AK5:AK1004),\"\")","v":0.705541237113402},{"$f":"IF(ROW(BC12)-8<=WineColorCount,SUMIF(Inventory!$AR$2:$AR$1001,$AJ12,Inventory!AL5:AL1004),\"\")","v":0.705541237113402},{"$f":"IF(ROW(BD12)-8<=WineColorCount,SUMIF(Inventory!$AR$2:$AR$1001,$AJ12,Inventory!AM5:AM1004),\"\")","v":0},{"$f":"IF(ROW(BE12)-8<=WineColorCount,SUMIF(Inventory!$AR$2:$AR$1001,$AJ12,Inventory!AN5:AN1004),\"\")","v":0},{"$f":"IF(ROW(BF12)-8<=WineColorCount,SUMIF(Inventory!$AR$2:$AR$1001,$AJ12,Inventory!AO5:AO1004),\"\")","v":0},null,null,null,null,null,null,null,null,"Walla Walla Valley","US",{"$f":"SUMIF(Inventory!$BF$2:$BF$2001,BR12&\"|\"&BQ12,Inventory!$H$2:$H$2001)/'Summary Stats'!$B$14","v":4.4293015332197615E-2}]
[null,null,null,null,2013,{"$f":"SUMIF(Purchases!$B$3:$B$2002,E13,Purchases!$M$3:$M$2002)","v":8},null,90,{"$f":"SUMIF(Purchases!$Q$3:$Q$2002,H13,Purchases!$M$3:$M$2002)/'Data Items'!$AK$43","v":4.4293015332197615E-2},4.4293015332197615E-2,null,"Nebbiolo",{"$f":"SUMIF(Purchases!$D$3:$D$2002,L13,Purchases!$M$3:$M$2002)/'Summary Stats'!$B$14","v":5.7921635434412269E-2},null,"Vendor 11",{"$f":"SUMIF(Purchases!$L$3:$L$2002,'Data Items'!O13,Purchases!$M$3:$M$2002)","v":5},{"$f":"SUMIF(Purchases!$L$3:$L$2002,'Data Items'!O13,Purchases!$K$3:$K$2002)+SUMIF('Fully Consumed'!$L$2:$L$2003,'Data Items'!O13,'Fully Consumed'!$K$2:$K$2003)","v":24},null,"Domaine du Vieux Télégraphe","FR",{"$f":"SUMIF(Purchases!$A$3:$A$2002,'Data Items'!S13,Purchases!$M$3:$M$2002)","v":1},null,null,null,null,"The Rocks of Milton-Freewater",{"$f":"SUMIF(Inventory!$AY$2:$AY$2001,'Data Items'!Z13,Inventory!$H$2:$H$2001)+SUMIF(Inventory!$BJ$2:$BJ$2001,'Data Items'!Z13,Inventory!$H$2:$H$2001)","v":24},{"$f":"COUNTIF(Inventory!$AY$2:$AY$2001,'Data Items'!Z13)+COUNTIF(Inventory!$BJ$2:$BJ$2001,'Data Items'!Z13)","v":8},null,null,null,null,null,null,null,"",{"$f":"IF(ROW(AI13)-8<=WineColorCount,SUMIF(Inventory!$AR$2:$AR$1001,$AJ13,Inventory!R6:R1005),\"\")","v":""},{"$f":"IF(ROW(AJ13)-8<=WineColorCount,SUMIF(Inventory!$AR$2:$AR$1001,$AJ13,Inventory!S6:S1005),\"\")","v":""},{"$f":"IF(ROW(AK13)-8<=WineColorCount,SUMIF(Inventory!$AR$2:$AR$1001,$AJ13,Inventory!T6:T1005),\"\")","v":""},{"$f":"IF(ROW(AL13)-8<=WineColorCount,SUMIF(Inventory!$AR$2:$AR$1001,$AJ13,Inventory!U6:U1005),\"\")","v":""},{"$f":"IF(ROW(AM13)-8<=WineColorCount,SUMIF(Inventory!$AR$2:$AR$1001,$AJ13,Inventory!V6:V1005),\"\")","v":""},{"$f":"IF(ROW(AN13)-8<=WineColorCount,SUMIF(Inventory!$AR$2:$AR$1001,$AJ13,Inventory!W6:W1005),\"\")","v":""},{"$f":"IF(ROW(AO13)-8<=WineColorCount,SUMIF(Inventory!$AR$2:$AR$1001,$AJ13,Inventory!X6:X1005),\"\")","v":""},{"$f":"IF(ROW(AP13)-8<=WineColorCount,SUMIF(Inventory!$AR$2:$AR$1001,$AJ13,Inventory!Y6:Y1005),\"\")","v":""},{"$f":"IF(ROW(AQ13)-8<=WineColorCount,SUMIF(Inventory!$AR$2:$AR$1001,$AJ13,Inventory!Z6:Z1005),\"\")","v":""},{"$f":"IF(ROW(AR13)-8<=WineColorCount,SUMIF(Inventory!$AR$2:$AR$1001,$AJ13,Inventory!AA6:AA1005),\"\")","v":""},{"$f":"IF(ROW(AS13)-8<=WineColorCount,SUMIF(Inventory!$AR$2:$AR$1001,$AJ13,Inventory!AB6:AB1005),\"\")","v":""},{"$f":"IF(ROW(AT13)-8<=WineColorCount,SUMIF(Inventory!$AR$2:$AR$1001,$AJ13,Inventory!AC6:AC1005),\"\")","v":""},{"$f":"IF(ROW(AU13)-8<=WineColorCount,SUMIF(Inventory!$AR$2:$AR$1001,$AJ13,Inventory!AD6:AD1005),\"\")","v":""},{"$f":"IF(ROW(AV13)-8<=WineColorCount,SUMIF(Inventory!$AR$2:$AR$1001,$AJ13,Inventory!AE6:AE1005),\"\")","v":""},{"$f":"IF(ROW(AW13)-8<=WineColorCount,SUMIF(Inventory!$AR$2:$AR$1001,$AJ13,Inventory!AF6:AF1005),\"\")","v":""},{"$f":"IF(ROW(AX13)-8<=WineColorCount,SUMIF(Inventory!$AR$2:$AR$1001,$AJ13,Inventory!AG6:AG1005),\"\")","v":""},{"$f":"IF(ROW(AY13)-8<=WineColorCount,SUMIF(Inventory!$AR$2:$AR$1001,$AJ13,Inventory!AH6:AH1005),\"\")","v":""},{"$f":"IF(ROW(AZ13)-8<=WineColorCount,SUMIF(Inventory!$AR$2:$AR$1001,$AJ13,Inventory!AI6:AI1005),\"\")","v":""},{"$f":"IF(ROW(BA13)-8<=WineColorCount,SUMIF(Inventory!$AR$2:$AR$1001,$AJ13,Inventory!AJ6:AJ1005),\"\")","v":""},{"$f":"IF(ROW(BB13)-8<=WineColorCount,SUMIF(Inventory!$AR$2:$AR$1001,$AJ13,Inventory!AK6:AK1005),\"\")","v":""},{"$f":"IF(ROW(BC13)-8<=WineColorCount,SUMIF(Inventory!$AR$2:$AR$1001,$AJ13,Inventory!AL6:AL1005),\"\")","v":""},{"$f":"IF(ROW(BD13)-8<=WineColorCount,SUMIF(Inventory!$AR$2:$AR$1001,$AJ13,Inventory!AM6:AM1005),\"\")","v":""},{"$f":"IF(ROW(BE13)-8<=WineColorCount,SUMIF(Inventory!$AR$2:$AR$1001,$AJ13,Inventory!AN6:AN1005),\"\")","v":""},{"$f":"IF(ROW(BF13)-8<=WineColorCount,SUMIF(Inventory!$AR$2:$AR$1001,$AJ13,Inventory!AO6:AO1005),\"\")","v":""},null,null,null,null,null,null,null,null,"Washington State","US",{"$f":"SUMIF(Inventory!$BF$2:$BF$2001,BR13&\"|\"&BQ13,Inventory!$H$2:$H$2001)/'Summary Stats'!$B$14","v":1.0221465076660987E-2}]
[null,null,null,null,2014,{"$f":"SUMIF(Purchases!$B$3:$B$2002,E14,Purchases!$M$3:$M$2002)","v":2},null,89,{"$f":"SUMIF(Purchases!$Q$3:$Q$2002,H14,Purchases!$M$3:$M$2002)/'Data Items'!$AK$43","v":0},0,null,"Nebbiolo Blend",{"$f":"SUMIF(Purchases!$D$3:$D$2002,L14,Purchases!$M$3:$M$2002)/'Summary Stats'!$B$14","v":1.5332197614991482E-2},null,"Vendor 12",{"$f":"SUMIF(Purchases!$L$3:$L$2002,'Data Items'!O14,Purchases!$M$3:$M$2002)","v":5},{"$f":"SUMIF(Purchases!$L$3:$L$2002,'Data Items'!O14,Purchases!$K$3:$K$2002)+SUMIF('Fully Consumed'!$L$2:$L$2003,'Data Items'!O14,'Fully Consumed'!$K$2:$K$2003)","v":12},null,"Domaine Giraud","FR",{"$f":"SUMIF(Purchases!$A$3:$A$2002,'Data Items'!S14,Purchases!$M$3:$M$2002)","v":11},null,null,null,null,"Turley",{"$f":"SUMIF(Inventory!$AY$2:$AY$2001,'Data Items'!Z14,Inventory!$H$2:$H$2001)+SUMIF(Inventory!$BJ$2:$BJ$2001,'Data Items'!Z14,Inventory!$H$2:$H$2001)","v":4},{"$f":"COUNTIF(Inventory!$AY$2:$AY$2001,'Data Items'!Z14)+COUNTIF(Inventory!$BJ$2:$BJ$2001,'Data Items'!Z14)","v":2},null,null,null,null,null,null,null,"",{"$f":"IF(ROW(AI14)-8<=WineColorCount,SUMIF(Inventory!$AR$2:$AR$1001,$AJ14,Inventory!R7:R1006),\"\")","v":""},{"$f":"IF(ROW(AJ14)-8<=WineColorCount,SUMIF(Inventory!$AR$2:$AR$1001,$AJ14,Inventory!S7:S1006),\"\")","v":""},1,{"$f":"IF(ROW(AL14)-8<=WineColorCount,SUMIF(Inventory!$AR$2:$AR$1001,$AJ14,Inventory!U7:U1006),\"\")","v":""},{"$f":"IF(ROW(AM14)-8<=WineColorCount,SUMIF(Inventory!$AR$2:$AR$1001,$AJ14,Inventory!V7:V1006),\"\")","v":""},{"$f":"IF(ROW(AN14)-8<=WineColorCount,SUMIF(Inventory!$AR$2:$AR$1001,$AJ14,Inventory!W7:W1006),\"\")","v":""},{"$f":"IF(ROW(AO14)-8<=WineColorCount,SUMIF(Inventory!$AR$2:$AR$1001,$AJ14,Inventory!X7:X1006),\"\")","v":""},{"$f":"IF(ROW(AP14)-8<=WineColorCount,SUMIF(Inventory!$AR$2:$AR$1001,$AJ14,Inventory!Y7:Y1006),\"\")","v":""},{"$f":"IF(ROW(AQ14)-8<=WineColorCount,SUMIF(Inventory!$AR$2:$AR$1001,$AJ14,Inventory!Z7:Z1006),\"\")","v":""},{"$f":"IF(ROW(AR14)-8<=WineColorCount,SUMIF(Inventory!$AR$2:$AR$1001,$AJ14,Inventory!AA7:AA1006),\"\")","v":""},{"$f":"IF(ROW(AS14)-8<=WineColorCount,SUMIF(Inventory!$AR$2:$AR$1001,$AJ14,Inventory!AB7:AB1006),\"\")","v":""},{"$f":"IF(ROW(AT14)-8<=WineColorCount,SUMIF(Inventory!$AR$2:$AR$1001,$AJ14,Inventory!AC7:AC1006),\"\")","v":""},{"$f":"IF(ROW(AU14)-8<=WineColorCount,SUMIF(Inventory!$AR$2:$AR$1001,$AJ14,Inventory!AD7:AD1006),\"\")","v":""},{"$f":"IF(ROW(AV14)-8<=WineColorCount,SUMIF(Inventory!$AR$2:$AR$1001,$AJ14,Inventory!AE7:AE1006),\"\")","v":""},{"$f":"IF(ROW(AW14)-8<=WineColorCount,SUMIF(Inventory!$AR$2:$AR$1001,$AJ14,Inventory!AF7:AF1006),\"\")","v":""},{"$f":"IF(ROW(AX14)-8<=WineColorCount,SUMIF(Inventory!$AR$2:$AR$1001,$AJ14,Inventory!AG7:AG1006),\"\")","v":""},{"$f":"IF(ROW(AY14)-8<=WineColorCount,SUMIF(Inventory!$AR$2:$AR$1001,$AJ14,Inventory!AH7:AH1006),\"\")","v":""},{"$f":"IF(ROW(AZ14)-8<=WineColorCount,SUMIF(Inventory!$AR$2:$AR$1001,$AJ14,Inventory!AI7:AI1006),\"\")","v":""},{"$f":"IF(ROW(BA14)-8<=WineColorCount,SUMIF(Inventory!$AR$2:$AR$1001,$AJ14,Inventory!AJ7:AJ1006),\"\")","v":""},{"$f":"IF(ROW(BB14)-8<=WineColorCount,SUMIF(Inventory!$AR$2:$AR$1001,$AJ14,Inventory!AK7:AK1006),\"\")","v":""},{"$f":"IF(ROW(BC14)-8<=WineColorCount,SUMIF(Inventory!$AR$2:$AR$1001,$AJ14,Inventory!AL7:AL1006),\"\")","v":""},{"$f":"IF(ROW(BD14)-8<=WineColorCount,SUMIF(Inventory!$AR$2:$AR$1001,$AJ14,Inventory!AM7:AM1006),\"\")","v":""},{"$f":"IF(ROW(BE14)-8<=WineColorCount,SUMIF(Inventory!$AR$2:$AR$1001,$AJ14,Inventory!AN7:AN1006),\"\")","v":""},{"$f":"IF(ROW(BF14)-8<=WineColorCount,SUMIF(Inventory!$AR$2:$AR$1001,$AJ14,Inventory!AO7:AO1006),\"\")","v":""},null,null,null,null,null,null,null,null,"Total",null,{"$f":"SUM(BS$3:BS13)","v":0.17206132879045996}]
[null,null,null,null,"Total",{"$f":"SUM(F$3:F14)","v":587},null,88,{"$f":"SUMIF(Purchases!$Q$3:$Q$2002,H15,Purchases!$M$3:$M$2002)/'Data Items'!$AK$43","v":0},0,null,"Petite Sirah",{"$f":"SUMIF(Purchases!$D$3:$D$2002,L15,Purchases!$M$3:$M$2002)/'Summary Stats'!$B$14","v":2.2146507666098807E-2},null,"Vendor 13",{"$f":"SUMIF(Purchases!$L$3:$L$2002,'Data Items'!O15,Purchases!$M$3:$M$2002)","v":99},{"$f":"SUMIF(Purchases!$L$3:$L$2002,'Data Items'!O15,Purchases!$K$3:$K$2002)+SUMIF('Fully Consumed'!$L$2:$L$2003,'Data Items'!O15,'Fully Consumed'!$K$2:$K$2003)","v":300},null,"Domaine Saint Prefert","FR",{"$f":"SUMIF(Purchases!$A$3:$A$2002,'Data Items'!S15,Purchases!$M$3:$M$2002)","v":10},null,null,null,null,null,null,null,null,null,null,null,null,null,null,"",{"$f":"IF(ROW(AI15)-8<=WineColorCount,SUMIF(Inventory!$AR$2:$AR$1001,$AJ15,Inventory!R8:R1007),\"\")","v":""},{"$f":"IF(ROW(AJ15)-8<=WineColorCount,SUMIF(Inventory!$AR$2:$AR$1001,$AJ15,Inventory!S8:S1007),\"\")","v":""},{"$f":"IF(ROW(AK15)-8<=WineColorCount,SUMIF(Inventory!$AR$2:$AR$1001,$AJ15,Inventory!T8:T1007),\"\")","v":""},{"$f":"IF(ROW(AL15)-8<=WineColorCount,SUMIF(Inventory!$AR$2:$AR$1001,$AJ15,Inventory!U8:U1007),\"\")","v":""},{"$f":"IF(ROW(AM15)-8<=WineColorCount,SUMIF(Inventory!$AR$2:$AR$1001,$AJ15,Inventory!V8:V1007),\"\")","v":""},{"$f":"IF(ROW(AN15)-8<=WineColorCount,SUMIF(Inventory!$AR$2:$AR$1001,$AJ15,Inventory!W8:W1007),\"\")","v":""},{"$f":"IF(ROW(AO15)-8<=WineColorCount,SUMIF(Inventory!$AR$2:$AR$1001,$AJ15,Inventory!X8:X1007),\"\")","v":""},{"$f":"IF(ROW(AP15)-8<=WineColorCount,SUMIF(Inventory!$AR$2:$AR$1001,$AJ15,Inventory!Y8:Y1007),\"\")","v":""},{"$f":"IF(ROW(AQ15)-8<=WineColorCount,SUMIF(Inventory!$AR$2:$AR$1001,$AJ15,Inventory!Z8:Z1007),\"\")","v":""},{"$f":"IF(ROW(AR15)-8<=WineColorCount,SUMIF(Inventory!$AR$2:$AR$1001,$AJ15,Inventory!AA8:AA1007),\"\")","v":""},{"$f":"IF(ROW(AS15)-8<=WineColorCount,SUMIF(Inventory!$AR$2:$AR$1001,$AJ15,Inventory!AB8:AB1007),\"\")","v":""},{"$f":"IF(ROW(AT15)-8<=WineColorCount,SUMIF(Inventory!$AR$2:$AR$1001,$AJ15,Inventory!AC8:AC1007),\"\")","v":""},{"$f":"IF(ROW(AU15)-8<=WineColorCount,SUMIF(Inventory!$AR$2:$AR$1001,$AJ15,Inventory!AD8:AD1007),\"\")","v":""},{"$f":"IF(ROW(AV15)-8<=WineColorCount,SUMIF(Inventory!$AR$2:$AR$1001,$AJ15,Inventory!AE8:AE1007),\"\")","v":""},{"$f":"IF(ROW(AW15)-8<=WineColorCount,SUMIF(Inventory!$AR$2:$AR$1001,$AJ15,Inventory!AF8:AF1007),\"\")","v":""},{"$f":"IF(ROW(AX15)-8<=WineColorCount,SUMIF(Inventory!$AR$2:$AR$1001,$AJ15,Inventory!AG8:AG1007),\"\")","v":""},{"$f":"IF(ROW(AY15)-8<=WineColorCount,SUMIF(Inventory!$AR$2:$AR$1001,$AJ15,Inventory!AH8:AH1007),\"\")","v":""},{"$f":"IF(ROW(AZ15)-8<=WineColorCount,SUMIF(Inventory!$AR$2:$AR$1001,$AJ15,Inventory!AI8:AI1007),\"\")","v":""},{"$f":"IF(ROW(BA15)-8<=WineColorCount,SUMIF(Inventory!$AR$2:$AR$1001,$AJ15,Inventory!AJ8:AJ1007),\"\")","v":""},{"$f":"IF(ROW(BB15)-8<=WineColorCount,SUMIF(Inventory!$AR$2:$AR$1001,$AJ15,Inventory!AK8:AK1007),\"\")","v":""},{"$f":"IF(ROW(BC15)-8<=WineColorCount,SUMIF(Inventory!$AR$2:$AR$1001,$AJ15,Inventory!AL8:AL1007),\"\")","v":""},{"$f":"IF(ROW(BD15)-8<=WineColorCount,SUMIF(Inventory!$AR$2:$AR$1001,$AJ15,Inventory!AM8:AM1007),\"\")","v":""},{"$f":"IF(ROW(BE15)-8<=WineColorCount,SUMIF(Inventory!$AR$2:$AR$1001,$AJ15,Inventory!AN8:AN1007),\"\")","v":""},{"$f":"IF(ROW(BF15)-8<=WineColorCount,SUMIF(Inventory!$AR$2:$AR$1001,$AJ15,Inventory!AO8:AO1007),\"\")","v":""}]
[null,null,null,null,null,null,null,87,{"$f":"SUMIF(Purchases!$Q$3:$Q$2002,H16,Purchases!$M$3:$M$2002)/'Data Items'!$AK$43","v":0},0,null,"Pinot Noir",{"$f":"SUMIF(Purchases!$D$3:$D$2002,L16,Purchases!$M$3:$M$2002)/'Summary Stats'!$B$14","v":2.0442930153321975E-2},null,"Vendor 14",{"$f":"SUMIF(Purchases!$L$3:$L$2002,'Data Items'!O16,Purchases!$M$3:$M$2002)","v":5},{"$f":"SUMIF(Purchases!$L$3:$L$2002,'Data Items'!O16,Purchases!$K$3:$K$2002)+SUMIF('Fully Consumed'!$L$2:$L$2003,'Data Items'!O16,'Fully Consumed'!$K$2:$K$2003)","v":6},null,"Donatella Cinelli Colombini","IT",{"$f":"SUMIF(Purchases!$A$3:$A$2002,'Data Items'!S16,Purchases!$M$3:$M$2002)","v":12},null,null,null,null,null,null,null,null,null,null,null,null,null,null,"",{"$f":"IF(ROW(AI16)-8<=WineColorCount,SUMIF(Inventory!$AR$2:$AR$1001,$AJ16,Inventory!R9:R1008),\"\")","v":""},{"$f":"IF(ROW(AJ16)-8<=WineColorCount,SUMIF(Inventory!$AR$2:$AR$1001,$AJ16,Inventory!S9:S1008),\"\")","v":""},{"$f":"IF(ROW(AK16)-8<=WineColorCount,SUMIF(Inventory!$AR$2:$AR$1001,$AJ16,Inventory!T9:T1008),\"\")","v":""},{"$f":"IF(ROW(AL16)-8<=WineColorCount,SUMIF(Inventory!$AR$2:$AR$1001,$AJ16,Inventory!U9:U1008),\"\")","v":""},{"$f":"IF(ROW(AM16)-8<=WineColorCount,SUMIF(Inventory!$AR$2:$AR$1001,$AJ16,Inventory!V9:V1008),\"\")","v":""},{"$f":"IF(ROW(AN16)-8<=WineColorCount,SUMIF(Inventory!$AR$2:$AR$1001,$AJ16,Inventory!W9:W1008),\"\")","v":""},{"$f":"IF(ROW(AO16)-8<=WineColorCount,SUMIF(Inventory!$AR$2:$AR$1001,$AJ16,Inventory!X9:X1008),\"\")","v":""},{"$f":"IF(ROW(AP16)-8<=WineColorCount,SUMIF(Inventory!$AR$2:$AR$1001,$AJ16,Inventory!Y9:Y1008),\"\")","v":""},{"$f":"IF(ROW(AQ16)-8<=WineColorCount,SUMIF(Inventory!$AR$2:$AR$1001,$AJ16,Inventory!Z9:Z1008),\"\")","v":""},{"$f":"IF(ROW(AR16)-8<=WineColorCount,SUMIF(Inventory!$AR$2:$AR$1001,$AJ16,Inventory!AA9:AA1008),\"\")","v":""},{"$f":"IF(ROW(AS16)-8<=WineColorCount,SUMIF(Inventory!$AR$2:$AR$1001,$AJ16,Inventory!AB9:AB1008),\"\")","v":""},{"$f":"IF(ROW(AT16)-8<=WineColorCount,SUMIF(Inventory!$AR$2:$AR$1001,$AJ16,Inventory!AC9:AC1008),\"\")","v":""},{"$f":"IF(ROW(AU16)-8<=WineColorCount,SUMIF(Inventory!$AR$2:$AR$1001,$AJ16,Inventory!AD9:AD1008),\"\")","v":""},{"$f":"IF(ROW(AV16)-8<=WineColorCount,SUMIF(Inventory!$AR$2:$AR$1001,$AJ16,Inventory!AE9:AE1008),\"\")","v":""},{"$f":"IF(ROW(AW16)-8<=WineColorCount,SUMIF(Inventory!$AR$2:$AR$1001,$AJ16,Inventory!AF9:AF1008),\"\")","v":""},{"$f":"IF(ROW(AX16)-8<=WineColorCount,SUMIF(Inventory!$AR$2:$AR$1001,$AJ16,Inventory!AG9:AG1008),\"\")","v":""},{"$f":"IF(ROW(AY16)-8<=WineColorCount,SUMIF(Inventory!$AR$2:$AR$1001,$AJ16,Inventory!AH9:AH1008),\"\")","v":""},{"$f":"IF(ROW(AZ16)-8<=WineColorCount,SUMIF(Inventory!$AR$2:$AR$1001,$AJ16,Inventory!AI9:AI1008),\"\")","v":""},{"$f":"IF(ROW(BA16)-8<=WineColorCount,SUMIF(Inventory!$AR$2:$AR$1001,$AJ16,Inventory!AJ9:AJ1008),\"\")","v":""},{"$f":"IF(ROW(BB16)-8<=WineColorCount,SUMIF(Inventory!$AR$2:$AR$1001,$AJ16,Inventory!AK9:AK1008),\"\")","v":""},{"$f":"IF(ROW(BC16)-8<=WineColorCount,SUMIF(Inventory!$AR$2:$AR$1001,$AJ16,Inventory!AL9:AL1008),\"\")","v":""},{"$f":"IF(ROW(BD16)-8<=WineColorCount,SUMIF(Inventory!$AR$2:$AR$1001,$AJ16,Inventory!AM9:AM1008),\"\")","v":""},{"$f":"IF(ROW(BE16)-8<=WineColorCount,SUMIF(Inventory!$AR$2:$AR$1001,$AJ16,Inventory!AN9:AN1008),\"\")","v":""},{"$f":"IF(ROW(BF16)-8<=WineColorCount,SUMIF(Inventory!$AR$2:$AR$1001,$AJ16,Inventory!AO9:AO1008),\"\")","v":""}]
[null,null,null,null,null,null,null,86,{"$f":"SUMIF(Purchases!$Q$3:$Q$2002,H17,Purchases!$M$3:$M$2002)/'Data Items'!$AK$43","v":0},0,null,"Port",{"$f":"SUMIF(Purchases!$D$3:$D$2002,L17,Purchases!$M$3:$M$2002)/'Summary Stats'!$B$14","v":6.8143100511073255E-3},null,"Vendor 15",{"$f":"SUMIF(Purchases!$L$3:$L$2002,'Data Items'!O17,Purchases!$M$3:$M$2002)","v":13},{"$f":"SUMIF(Purchases!$L$3:$L$2002,'Data Items'!O17,Purchases!$K$3:$K$2002)+SUMIF('Fully Consumed'!$L$2:$L$2003,'Data Items'!O17,'Fully Consumed'!$K$2:$K$2003)","v":66},null,"Dow","PT",{"$f":"SUMIF(Purchases!$A$3:$A$2002,'Data Items'!S17,Purchases!$M$3:$M$2002)","v":4},null,null,null,null,null,null,null,null,null,null,null,null,null,null,"",{"$f":"IF(ROW(AI17)-8<=WineColorCount,SUMIF(Inventory!$AR$2:$AR$1001,$AJ17,Inventory!R10:R1009),\"\")","v":""},{"$f":"IF(ROW(AJ17)-8<=WineColorCount,SUMIF(Inventory!$AR$2:$AR$1001,$AJ17,Inventory!S10:S1009),\"\")","v":""},{"$f":"IF(ROW(AK17)-8<=WineColorCount,SUMIF(Inventory!$AR$2:$AR$1001,$AJ17,Inventory!T10:T1009),\"\")","v":""},{"$f":"IF(ROW(AL17)-8<=WineColorCount,SUMIF(Inventory!$AR$2:$AR$1001,$AJ17,Inventory!U10:U1009),\"\")","v":""},{"$f":"IF(ROW(AM17)-8<=WineColorCount,SUMIF(Inventory!$AR$2:$AR$1001,$AJ17,Inventory!V10:V1009),\"\")","v":""},{"$f":"IF(ROW(AN17)-8<=WineColorCount,SUMIF(Inventory!$AR$2:$AR$1001,$AJ17,Inventory!W10:W1009),\"\")","v":""},{"$f":"IF(ROW(AO17)-8<=WineColorCount,SUMIF(Inventory!$AR$2:$AR$1001,$AJ17,Inventory!X10:X1009),\"\")","v":""},{"$f":"IF(ROW(AP17)-8<=WineColorCount,SUMIF(Inventory!$AR$2:$AR$1001,$AJ17,Inventory!Y10:Y1009),\"\")","v":""},{"$f":"IF(ROW(AQ17)-8<=WineColorCount,SUMIF(Inventory!$AR$2:$AR$1001,$AJ17,Inventory!Z10:Z1009),\"\")","v":""},{"$f":"IF(ROW(AR17)-8<=WineColorCount,SUMIF(Inventory!$AR$2:$AR$1001,$AJ17,Inventory!AA10:AA1009),\"\")","v":""},{"$f":"IF(ROW(AS17)-8<=WineColorCount,SUMIF(Inventory!$AR$2:$AR$1001,$AJ17,Inventory!AB10:AB1009),\"\")","v":""},{"$f":"IF(ROW(AT17)-8<=WineColorCount,SUMIF(Inventory!$AR$2:$AR$1001,$AJ17,Inventory!AC10:AC1009),\"\")","v":""},{"$f":"IF(ROW(AU17)-8<=WineColorCount,SUMIF(Inventory!$AR$2:$AR$1001,$AJ17,Inventory!AD10:AD1009),\"\")","v":""},{"$f":"IF(ROW(AV17)-8<=WineColorCount,SUMIF(Inventory!$AR$2:$AR$1001,$AJ17,Inventory!AE10:AE1009),\"\")","v":""},{"$f":"IF(ROW(AW17)-8<=WineColorCount,SUMIF(Inventory!$AR$2:$AR$1001,$AJ17,Inventory!AF10:AF1009),\"\")","v":""},{"$f":"IF(ROW(AX17)-8<=WineColorCount,SUMIF(Inventory!$AR$2:$AR$1001,$AJ17,Inventory!AG10:AG1009),\"\")","v":""},{"$f":"IF(ROW(AY17)-8<=WineColorCount,SUMIF(Inventory!$AR$2:$AR$1001,$AJ17,Inventory!AH10:AH1009),\"\")","v":""},{"$f":"IF(ROW(AZ17)-8<=WineColorCount,SUMIF(Inventory!$AR$2:$AR$1001,$AJ17,Inventory!AI10:AI1009),\"\")","v":""},{"$f":"IF(ROW(BA17)-8<=WineColorCount,SUMIF(Inventory!$AR$2:$AR$1001,$AJ17,Inventory!AJ10:AJ1009),\"\")","v":""},{"$f":"IF(ROW(BB17)-8<=WineColorCount,SUMIF(Inventory!$AR$2:$AR$1001,$AJ17,Inventory!AK10:AK1009),\"\")","v":""},{"$f":"IF(ROW(BC17)-8<=WineColorCount,SUMIF(Inventory!$AR$2:$AR$1001,$AJ17,Inventory!AL10:AL1009),\"\")","v":""},{"$f":"IF(ROW(BD17)-8<=WineColorCount,SUMIF(Inventory!$AR$2:$AR$1001,$AJ17,Inventory!AM10:AM1009),\"\")","v":""},{"$f":"IF(ROW(BE17)-8<=WineColorCount,SUMIF(Inventory!$AR$2:$AR$1001,$AJ17,Inventory!AN10:AN1009),\"\")","v":""},{"$f":"IF(ROW(BF17)-8<=WineColorCount,SUMIF(Inventory!$AR$2:$AR$1001,$AJ17,Inventory!AO10:AO1009),\"\")","v":""}]
[null,null,null,null,null,null,null,85,{"$f":"SUMIF(Purchases!$Q$3:$Q$2002,H18,Purchases!$M$3:$M$2002)/'Data Items'!$AK$43","v":0},0,null,"Riesling",{"$f":"SUMIF(Purchases!$D$3:$D$2002,L18,Purchases!$M$3:$M$2002)/'Summary Stats'!$B$14","v":2.2146507666098807E-2},null,"Vendor 16",{"$f":"SUMIF(Purchases!$L$3:$L$2002,'Data Items'!O18,Purchases!$M$3:$M$2002)","v":37},{"$f":"SUMIF(Purchases!$L$3:$L$2002,'Data Items'!O18,Purchases!$K$3:$K$2002)+SUMIF('Fully Consumed'!$L$2:$L$2003,'Data Items'!O18,'Fully Consumed'!$K$2:$K$2003)","v":141},null,"Durand (Eric & Joel)","FR",{"$f":"SUMIF(Purchases!$A$3:$A$2002,'Data Items'!S18,Purchases!$M$3:$M$2002)","v":10},null,null,null,null,null,null,null,null,null,null,null,null,null,null,null,null,null,null,null,null,null,null,{"$f":"IF(ROW(AP18)-8<=WineColorCount,SUMIF(Inventory!$AR$2:$AR$1001,$AJ18,Inventory!Y11:Y1010),\"\")","v":""},{"$f":"IF(ROW(AQ18)-8<=WineColorCount,SUMIF(Inventory!$AR$2:$AR$1001,$AJ18,Inventory!Z11:Z1010),\"\")","v":""},{"$f":"IF(ROW(AR18)-8<=WineColorCount,SUMIF(Inventory!$AR$2:$AR$1001,$AJ18,Inventory!AA11:AA1010),\"\")","v":""}]
[null,null,null,null,null,null,null,84,{"$f":"SUMIF(Purchases!$Q$3:$Q$2002,H19,Purchases!$M$3:$M$2002)/'Data Items'!$AK$43","v":0},0,null,"Sangiovese",{"$f":"SUMIF(Purchases!$D$3:$D$2002,L19,Purchases!$M$3:$M$2002)/'Summary Stats'!$B$14","v":1.5332197614991482E-2},null,"Vendor 17",{"$f":"SUMIF(Purchases!$L$3:$L$2002,'Data Items'!O19,Purchases!$M$3:$M$2002)","v":5},{"$f":"SUMIF(Purchases!$L$3:$L$2002,'Data Items'!O19,Purchases!$K$3:$K$2002)+SUMIF('Fully Consumed'!$L$2:$L$2003,'Data Items'!O19,'Fully Consumed'!$K$2:$K$2003)","v":10},null,"Evening Land Vineyards","US",{"$f":"SUMIF(Purchases!$A$3:$A$2002,'Data Items'!S19,Purchases!$M$3:$M$2002)","v":5},null,null,null,null,null,null,null,null,null,null,null,null,null,null,"# Wines On Hand",{"$f":"COUNTA(Purchases!A3:A2001)","v":94},null,null,null,"Date","# Bottles","Avg Age (Yrs)","Avg Age (Days)","Delta Days","Delta Days %","# Bottles Per Day","Total Value","Average Rating Score","# Wines On-Hand"]
[null,null,null,null,null,null,null,83,{"$f":"SUMIF(Purchases!$Q$3:$Q$2002,H20,Purchases!$M$3:$M$2002)/'Data Items'!$AK$43","v":0},0,null,"Sangiovese Blend",{"$f":"SUMIF(Purchases!$D$3:$D$2002,L20,Purchases!$M$3:$M$2002)/'Summary Stats'!$B$14","v":2.385008517887564E-2},null,"Vendor 18",{"$f":"SUMIF(Purchases!$L$3:$L$2002,'Data Items'!O20,Purchases!$M$3:$M$2002)","v":3},{"$f":"SUMIF(Purchases!$L$3:$L$2002,'Data Items'!O20,Purchases!$K$3:$K$2002)+SUMIF('Fully Consumed'!$L$2:$L$2003,'Data Items'!O20,'Fully Consumed'!$K$2:$K$2003)","v":3},null,"Four Vines","US",{"$f":"SUMIF(Purchases!$A$3:$A$2002,'Data Items'!S20,Purchases!$M$3:$M$2002)","v":12},null,null,null,null,null,null,null,null,null,null,null,null,null,null,"# Wines Consumed",{"$f":"COUNTA('Fully Consumed'!A2:A2003)","v":120}]
[null,null,null,null,null,null,null,82,{"$f":"SUMIF(Purchases!$Q$3:$Q$2002,H21,Purchases!$M$3:$M$2002)/'Data Items'!$AK$43","v":0},0,null,"Shiraz/Syrah",{"$f":"SUMIF(Purchases!$D$3:$D$2002,L21,Purchases!$M$3:$M$2002)/'Summary Stats'!$B$14","v":0.35775127768313458},null,"Vendor 19",{"$f":"SUMIF(Purchases!$L$3:$L$2002,'Data Items'!O21,Purchases!$M$3:$M$2002)","v":15},{"$f":"SUMIF(Purchases!$L$3:$L$2002,'Data Items'!O21,Purchases!$K$3:$K$2002)+SUMIF('Fully Consumed'!$L$2:$L$2003,'Data Items'!O21,'Fully Consumed'!$K$2:$K$2003)","v":24},null,"Fox Gordon","AU",{"$f":"SUMIF(Purchases!$A$3:$A$2002,'Data Items'!S21,Purchases!$M$3:$M$2002)","v":2},null,null,null,null,null,null,null,null,null,null,null,null,null,null,"# Wines in Inv",{"$f":"COUNTA(Inventory!A2:A1001)","v":93},null,null,null,"2008-04-23",401,3.1714925131314802,{"$f":"AQ21*365","v":1157.5947672929904}]
[null,null,null,null,null,null,null,81,{"$f":"SUMIF(Purchases!$Q$3:$Q$2002,H22,Purchases!$M$3:$M$2002)/'Data Items'!$AK$43","v":0},0,null,"Shiraz/Syrah Blend",{"$f":"SUMIF(Purchases!$D$3:$D$2002,L22,Purchases!$M$3:$M$2002)/'Summary Stats'!$B$14","v":1.3628620102214651E-2},null,"Vendor 20",{"$f":"SUMIF(Purchases!$L$3:$L$2002,'Data Items'!O22,Purchases!$M$3:$M$2002)","v":0},{"$f":"SUMIF(Purchases!$L$3:$L$2002,'Data Items'!O22,Purchases!$K$3:$K$2002)+SUMIF('Fully Consumed'!$L$2:$L$2003,'Data Items'!O22,'Fully Consumed'!$K$2:$K$2003)","v":12},null,"Giovanni Corino","IT",{"$f":"SUMIF(Purchases!$A$3:$A$2002,'Data Items'!S22,Purchases!$M$3:$M$2002)","v":11},null,null,null,null,null,null,null,null,null,null,null,null,null,null,"# Wines on Shopping List",{"$f":"COUNTA('Shopping List'!A2:A201)","v":0},null,null,null,"2008-05-21",405,3.2150297944704702,{"$f":"AQ22*365","v":1173.4858749817217},{"$f":"AR22-AR21","v":15.891107688731381},{"$f":"AS22/(AO22-AO21)","v":0.56753956031183506},0.62999999523162842,11138.1,91.48,null,"Estimated from historical data"]
[null,null,null,null,null,null,null,80,{"$f":"SUMIF(Purchases!$Q$3:$Q$2002,H23,Purchases!$M$3:$M$2002)/'Data Items'!$AK$43","v":0},{"$f":"I23","v":0},null,"Tempranillo Blend",{"$f":"SUMIF(Purchases!$D$3:$D$2002,L23,Purchases!$M$3:$M$2002)/'Summary Stats'!$B$14","v":7.6660988074957415E-2},null,"Vendor 21",{"$f":"SUMIF(Purchases!$L$3:$L$2002,'Data Items'!O23,Purchases!$M$3:$M$2002)","v":3},{"$f":"SUMIF(Purchases!$L$3:$L$2002,'Data Items'!O23,Purchases!$K$3:$K$2002)+SUMIF('Fully Consumed'!$L$2:$L$2003,'Data Items'!O23,'Fully Consumed'!$K$2:$K$2003)","v":6},null,"Guy Saget","FR",{"$f":"SUMIF(Purchases!$A$3:$A$2002,'Data Items'!S23,Purchases!$M$3:$M$2002)","v":12},null,null,null,null,null,null,null,null,null,null,null,null,null,null,"Show Wines",2,null,null,null,"2008-06-24",439,3.1685509348212801,{"$f":"AQ23*365","v":1156.5210912097673},{"$f":"AR23-AR22","v":-16.964783771954444},{"$f":"AS23/(AO23-AO22)","v":-0.49896422858689543},0.45000001788139343,11674.7,91.32]
[null,null,null,null,null,null,null,"Total",{"$f":"SUM(I$3:I23)","v":1},null,null,"Touriga Blend",{"$f":"SUMIF(Purchases!$D$3:$D$2002,L24,Purchases!$M$3:$M$2002)/'Summary Stats'!$B$14","v":2.7257240204429302E-2},null,"Vendor 22",{"$f":"SUMIF(Purchases!$L$3:$L$2002,'Data Items'!O24,Purchases!$M$3:$M$2002)","v":0},{"$f":"SUMIF(Purchases!$L$3:$L$2002,'Data Items'!O24,Purchases!$K$3:$K$2002)+SUMIF('Fully Consumed'!$L$2:$L$2003,'Data Items'!O24,'Fully Consumed'!$K$2:$K$2003)","v":3},null,"Hall","US",{"$f":"SUMIF(Purchases!$A$3:$A$2002,'Data Items'!S24,Purchases!$M$3:$M$2002)","v":8},null,null,null,null,null,null,null,null,null,null,null,null,null,null,"Everyday Max Score",93,null,null,null,"2008-07-26",457,3.2404978293245801,1182.7817077034717,26.260616493704447,0.82064426542826396,0.49000000953674316,11122.56,91.02]
[null,null,null,null,null,null,null,null,null,null,null,"Vidal",{"$f":"SUMIF(Purchases!$D$3:$D$2002,L25,Purchases!$M$3:$M$2002)/'Summary Stats'!$B$14","v":3.4071550255536627E-3},null,"Vendor 23",{"$f":"SUMIF(Purchases!$L$3:$L$2002,'Data Items'!O25,Purchases!$M$3:$M$2002)","v":10},{"$f":"SUMIF(Purchases!$L$3:$L$2002,'Data Items'!O25,Purchases!$K$3:$K$2002)+SUMIF('Fully Consumed'!$L$2:$L$2003,'Data Items'!O25,'Fully Consumed'!$K$2:$K$2003)","v":12},null,"Horsepower Vineyards","US",{"$f":"SUMIF(Purchases!$A$3:$A$2002,'Data Items'!S25,Purchases!$M$3:$M$2002)","v":3},null,null,null,null,null,null,null,null,null,null,null,null,null,null,"Special Min Score",95,null,null,null,"2008-08-19",451,3.3047335606841099,1206.2277496497002,23.446041946228434,0.97691841442618477,0.56999999284744263,10794.52,91.06]
[null,null,null,null,null,null,null,null,null,null,null,"Zinfandel",{"$f":"SUMIF(Purchases!$D$3:$D$2002,L26,Purchases!$M$3:$M$2002)/'Summary Stats'!$B$14","v":8.5178875638841564E-3},null,"Vendor 24",{"$f":"SUMIF(Purchases!$L$3:$L$2002,'Data Items'!O26,Purchases!$M$3:$M$2002)","v":1},{"$f":"SUMIF(Purchases!$L$3:$L$2002,'Data Items'!O26,Purchases!$K$3:$K$2002)+SUMIF('Fully Consumed'!$L$2:$L$2003,'Data Items'!O26,'Fully Consumed'!$K$2:$K$2003)","v":3},null,"I Balzini","IT",{"$f":"SUMIF(Purchases!$A$3:$A$2002,'Data Items'!S26,Purchases!$M$3:$M$2002)","v":10},null,null,null,null,null,null,null,null,null,null,null,null,null,null,"Everyday Max Price",38,null,null,null,"2008-08-28",449,3.3295036956972202,1215.2688489294853,9.0410992797851577,1.0045665866427953,0.22333334386348724,10749.63,91.08]
[null,null,null,null,null,null,null,null,null,null,null,"Total",{"$f":"SUM(M$3:M26)","v":1},null,"Vendor 25",{"$f":"SUMIF(Purchases!$L$3:$L$2002,'Data Items'!O27,Purchases!$M$3:$M$2002)","v":0},{"$f":"SUMIF(Purchases!$L$3:$L$2002,'Data Items'!O27,Purchases!$K$3:$K$2002)+SUMIF('Fully Consumed'!$L$2:$L$2003,'Data Items'!O27,'Fully Consumed'!$K$2:$K$2003)","v":60},null,"Inniskillin","CA",{"$f":"SUMIF(Purchases!$A$3:$A$2002,'Data Items'!S27,Purchases!$M$3:$M$2002)","v":2},null,null,null,null,null,null,null,null,null,null,null,null,null,null,"Special Min Price",50,null,null,null,"2008-09-23",461,3.3576686417317201,1225.5490542320779,10.280205302592549,0.39539251163817496,0.42333331704139709,11034.2,91.11]
[null,null,null,null,null,null,null,null,null,null,null,null,null,null,"Vendor 26",{"$f":"SUMIF(Purchases!$L$3:$L$2002,'Data Items'!O28,Purchases!$M$3:$M$2002)","v":2},{"$f":"SUMIF(Purchases!$L$3:$L$2002,'Data Items'!O28,Purchases!$K$3:$K$2002)+SUMIF('Fully Consumed'!$L$2:$L$2003,'Data Items'!O28,'Fully Consumed'!$K$2:$K$2003)","v":48},null,"Jaffurs","US",{"$f":"SUMIF(Purchases!$A$3:$A$2002,'Data Items'!S28,Purchases!$M$3:$M$2002)","v":1},null,null,null,null,null,null,null,null,null,null,null,null,null,null,"Categorize Wines By",0,null,null,null,"2008-10-26",480,3.3694338359335299,1229.8433501157383,4.2942958836604248,0.13013017829274015,0.44333335757255554,11095.54,91.2]
[null,null,null,null,null,null,null,null,null,null,null,null,null,null,"Vendor 27",{"$f":"SUMIF(Purchases!$L$3:$L$2002,'Data Items'!O29,Purchases!$M$3:$M$2002)","v":12},{"$f":"SUMIF(Purchases!$L$3:$L$2002,'Data Items'!O29,Purchases!$K$3:$K$2002)+SUMIF('Fully Consumed'!$L$2:$L$2003,'Data Items'!O29,'Fully Consumed'!$K$2:$K$2003)","v":12},null,"Jean-Luc Columbo","FR",{"$f":"SUMIF(Purchases!$A$3:$A$2002,'Data Items'!S29,Purchases!$M$3:$M$2002)","v":12},null,null,null,null,null,null,null,null,null,null,null,null,null,null,"Sort Wines By",3,null,null,null,"2008-11-23",494,3.36725309121945,1229.0473782950992,-0.79597182063912442,-2.8427565022825872E-2,0.53666669130325317,11458.53,91.32]
[null,null,null,null,null,null,null,null,null,null,null,null,null,null,"Vendor 28",{"$f":"SUMIF(Purchases!$L$3:$L$2002,'Data Items'!O30,Purchases!$M$3:$M$2002)","v":0},{"$f":"SUMIF(Purchases!$L$3:$L$2002,'Data Items'!O30,Purchases!$K$3:$K$2002)+SUMIF('Fully Consumed'!$L$2:$L$2003,'Data Items'!O30,'Fully Consumed'!$K$2:$K$2003)","v":12},null,"K Vintners","US",{"$f":"SUMIF(Purchases!$A$3:$A$2002,'Data Items'!S30,Purchases!$M$3:$M$2002)","v":17},null,null,null,null,null,null,null,null,null,null,null,null,null,null,"Opt Button",6,null,null,null,"2008-12-23",488,3.4566644386663499,1261.6825201132176,32.635141818118427,1.0878380606039475,0.45666667819023132,11541.99,91.49]
[null,null,null,null,null,null,null,null,null,null,null,null,null,null,"Vendor 29",{"$f":"SUMIF(Purchases!$L$3:$L$2002,'Data Items'!O31,Purchases!$M$3:$M$2002)","v":0},{"$f":"SUMIF(Purchases!$L$3:$L$2002,'Data Items'!O31,Purchases!$K$3:$K$2002)+SUMIF('Fully Consumed'!$L$2:$L$2003,'Data Items'!O31,'Fully Consumed'!$K$2:$K$2003)","v":4},null,"Konzelmann","CA",{"$f":"SUMIF(Purchases!$A$3:$A$2002,'Data Items'!S31,Purchases!$M$3:$M$2002)","v":1},null,null,null,null,null,null,null,null,null,null,null,null,null,null,"Inventory Inclusion",0,null,null,null,"2009-01-23",481,3.5529965227055298,1296.8437307875183,35.161210674300719,1.1342326023967975,0.35333332419395447,11665.95,91.62]
[null,null,null,null,null,null,null,null,null,null,null,null,null,null,"Vendor 30",{"$f":"SUMIF(Purchases!$L$3:$L$2002,'Data Items'!O32,Purchases!$M$3:$M$2002)","v":0},{"$f":"SUMIF(Purchases!$L$3:$L$2002,'Data Items'!O32,Purchases!$K$3:$K$2002)+SUMIF('Fully Consumed'!$L$2:$L$2003,'Data Items'!O32,'Fully Consumed'!$K$2:$K$2003)","v":86},null,"La Colombina","IT",{"$f":"SUMIF(Purchases!$A$3:$A$2002,'Data Items'!S32,Purchases!$M$3:$M$2002)","v":6},null,null,null,null,null,null,null,null,null,null,null,null,null,null,"Data Maintenance Opt",7,null,null,null,"2009-02-23",479,3.6000590351531798,1314.0215478309105,17.177817043392224,0.55412313043200723,0.5899999737739563,11640.97,91.65]
[null,null,null,null,null,null,null,null,null,null,null,null,null,null,"Vendor 31",{"$f":"SUMIF(Purchases!$L$3:$L$2002,'Data Items'!O33,Purchases!$M$3:$M$2002)","v":16},{"$f":"SUMIF(Purchases!$L$3:$L$2002,'Data Items'!O33,Purchases!$K$3:$K$2002)+SUMIF('Fully Consumed'!$L$2:$L$2003,'Data Items'!O33,'Fully Consumed'!$K$2:$K$2003)","v":48},null,"La Rioja Alta","ES",{"$f":"SUMIF(Purchases!$A$3:$A$2002,'Data Items'!S33,Purchases!$M$3:$M$2002)","v":12},null,null,null,null,null,null,null,null,null,null,null,null,null,null,"Last Cellar Update","2015-08-23",null,null,null,"2009-03-23",479,3.6122059822082502,1318.4551835060113,4.4336356751007315,0.15834413125359756,0.58333331346511841,11413.63,91.62]
[null,null,null,null,null,null,null,null,null,null,null,null,null,null,"Vendor 32",{"$f":"SUMIF(Purchases!$L$3:$L$2002,'Data Items'!O34,Purchases!$M$3:$M$2002)","v":0},{"$f":"SUMIF(Purchases!$L$3:$L$2002,'Data Items'!O34,Purchases!$K$3:$K$2002)+SUMIF('Fully Consumed'!$L$2:$L$2003,'Data Items'!O34,'Fully Consumed'!$K$2:$K$2003)","v":12},null,"La Serena","IT",{"$f":"SUMIF(Purchases!$A$3:$A$2002,'Data Items'!S34,Purchases!$M$3:$M$2002)","v":13},null,null,null,null,null,null,null,null,null,null,null,null,null,null,"Day of Cellar Update",23,null,null,null,"2009-04-23",484,3.68396043777466,1344.6455597877509,26.190376281739645,0.84485084779805308,0.48333334922790527,11472.07,91.61]
[null,null,null,null,null,null,null,null,null,null,null,null,null,null,"Vendor 33",{"$f":"SUMIF(Purchases!$L$3:$L$2002,'Data Items'!O35,Purchases!$M$3:$M$2002)","v":2},{"$f":"SUMIF(Purchases!$L$3:$L$2002,'Data Items'!O35,Purchases!$K$3:$K$2002)+SUMIF('Fully Consumed'!$L$2:$L$2003,'Data Items'!O35,'Fully Consumed'!$K$2:$K$2003)","v":3},null,"Le Vieux Donjon","FR",{"$f":"SUMIF(Purchases!$A$3:$A$2002,'Data Items'!S35,Purchases!$M$3:$M$2002)","v":5},null,null,null,null,null,null,null,null,null,null,null,null,null,null,"Cellar Update Count",{"$f":"COUNTA(AP21:AP1031)","v":90},null,null,null,"2009-05-23",491,3.7316737174987802,1362.0609068870547,17.415347099303744,0.58051156997679143,0.42333331704139709,11703.91,91.66]
[null,null,null,null,null,null,null,null,null,null,null,null,null,null,"Vendor 34",{"$f":"SUMIF(Purchases!$L$3:$L$2002,'Data Items'!O36,Purchases!$M$3:$M$2002)","v":8},{"$f":"SUMIF(Purchases!$L$3:$L$2002,'Data Items'!O36,Purchases!$K$3:$K$2002)+SUMIF('Fully Consumed'!$L$2:$L$2003,'Data Items'!O36,'Fully Consumed'!$K$2:$K$2003)","v":12},null,"Limerick Lane","US",{"$f":"SUMIF(Purchases!$A$3:$A$2002,'Data Items'!S36,Purchases!$M$3:$M$2002)","v":1},null,null,null,null,null,null,null,null,null,null,null,null,null,null,"Drink-Through Year Update",2015,null,null,null,"2009-06-23",501,3.7503292560577401,1368.8701784610751,6.8092715740203857,0.2196539217425931,0.42999997735023499,11773.3,91.61]
[null,null,null,null,null,null,null,null,null,null,null,null,null,null,"Vendor 35",{"$f":"SUMIF(Purchases!$L$3:$L$2002,'Data Items'!O37,Purchases!$M$3:$M$2002)","v":0},{"$f":"SUMIF(Purchases!$L$3:$L$2002,'Data Items'!O37,Purchases!$K$3:$K$2002)+SUMIF('Fully Consumed'!$L$2:$L$2003,'Data Items'!O37,'Fully Consumed'!$K$2:$K$2003)","v":12},null,"Marchesi de' Frescobaldi","IT",{"$f":"SUMIF(Purchases!$A$3:$A$2002,'Data Items'!S37,Purchases!$M$3:$M$2002)","v":12},null,null,null,null,null,null,null,null,null,null,null,null,null,null,null,null,null,null,null,"2009-07-23",502,3.8242371082305899,1395.8465445041654,26.976366043090366,0.8992122014363455,0.49000000953674316,11822.03,91.59]
[null,null,null,null,null,null,null,null,null,null,null,null,null,null,"Vendor 36",{"$f":"SUMIF(Purchases!$L$3:$L$2002,'Data Items'!O38,Purchases!$M$3:$M$2002)","v":11},{"$f":"SUMIF(Purchases!$L$3:$L$2002,'Data Items'!O38,Purchases!$K$3:$K$2002)+SUMIF('Fully Consumed'!$L$2:$L$2003,'Data Items'!O38,'Fully Consumed'!$K$2:$K$2003)","v":47},null,"Massolino","IT",{"$f":"SUMIF(Purchases!$A$3:$A$2002,'Data Items'!S38,Purchases!$M$3:$M$2002)","v":12},null,null,null,null,null,null,null,null,null,null,null,null,null,null,"Short Hold (< 3 Yrs)",{"$f":"AL38/$AL$41","v":0.141396933560477},{"$f":"SUM(Inventory!H2:H1001)-'Data Items'!AL39-'Data Items'!AL40","v":83},null,null,"2009-08-23",497,3.8918302059173602,1420.5180251598365,24.671480655671076,0.79585421469906692,0.45000001788139343,11869.5,91.69]
[null,null,null,null,null,null,null,null,null,null,null,null,null,null,"Vendor 37",{"$f":"SUMIF(Purchases!$L$3:$L$2002,'Data Items'!O39,Purchases!$M$3:$M$2002)","v":0},{"$f":"SUMIF(Purchases!$L$3:$L$2002,'Data Items'!O39,Purchases!$K$3:$K$2002)+SUMIF('Fully Consumed'!$L$2:$L$2003,'Data Items'!O39,'Fully Consumed'!$K$2:$K$2003)","v":6},null,"Neyers","US",{"$f":"SUMIF(Purchases!$A$3:$A$2002,'Data Items'!S39,Purchases!$M$3:$M$2002)","v":3},null,null,null,null,null,null,null,null,null,null,null,null,null,null,"Medium Hold (4-6 Yrs)",{"$f":"AL39/$AL$41","v":0.37137989778534924},{"$f":"SUMIF(Inventory!$O$2:$O$1001,\">=\"&Inventory!$R$1+4,Inventory!$H$2:$H$1001)-AL40","v":218},null,null,"2009-09-23",486,3.9760673046112101,1451.2645661830916,30.746541023255077,0.9918239039759702,0.36666667461395264,11750.1,91.72]
[null,null,null,null,null,null,null,null,null,null,null,null,null,null,"Vendor 38",{"$f":"SUMIF(Purchases!$L$3:$L$2002,'Data Items'!O40,Purchases!$M$3:$M$2002)","v":0},{"$f":"SUMIF(Purchases!$L$3:$L$2002,'Data Items'!O40,Purchases!$K$3:$K$2002)+SUMIF('Fully Consumed'!$L$2:$L$2003,'Data Items'!O40,'Fully Consumed'!$K$2:$K$2003)","v":12},null,"No Girls Wines","US",{"$f":"SUMIF(Purchases!$A$3:$A$2002,'Data Items'!S40,Purchases!$M$3:$M$2002)","v":8},null,null,null,null,null,null,null,null,null,null,null,null,null,null,"Long Hold (> 6 Yrs)",{"$f":"AL40/$AL$41","v":0.48722316865417375},{"$f":"SUMIF(Inventory!$O$2:$O$1001,\">\"&Inventory!$R$1+6,Inventory!$H$2:$H$1001)","v":286},null,null,"2009-10-23",475,4.0586633682251003,1481.4121294021616,30.14756321906998,1.0049187739689993,0.49000000953674316,11640.36,91.78]
[null,null,null,null,null,null,null,null,null,null,null,null,null,null,"Vendor 39",{"$f":"SUMIF(Purchases!$L$3:$L$2002,'Data Items'!O41,Purchases!$M$3:$M$2002)","v":9},{"$f":"SUMIF(Purchases!$L$3:$L$2002,'Data Items'!O41,Purchases!$K$3:$K$2002)+SUMIF('Fully Consumed'!$L$2:$L$2003,'Data Items'!O41,'Fully Consumed'!$K$2:$K$2003)","v":24},null,"Owen Roe","US",{"$f":"SUMIF(Purchases!$A$3:$A$2002,'Data Items'!S41,Purchases!$M$3:$M$2002)","v":3},null,null,null,null,null,null,null,null,null,null,null,null,null,null,"Total Bottles",null,{"$f":"SUM(AL38:AL40)","v":587},null,null,"2009-11-23",489,4.03308057785034,1472.0744109153741,-9.3377184867874803,-0.3012167253802413,0.47333332896232605,12023.65,91.81]
[null,null,null,null,null,null,null,null,null,null,null,null,null,null,"Vendor 40",{"$f":"SUMIF(Purchases!$L$3:$L$2002,'Data Items'!O42,Purchases!$M$3:$M$2002)","v":5},{"$f":"SUMIF(Purchases!$L$3:$L$2002,'Data Items'!O42,Purchases!$K$3:$K$2002)+SUMIF('Fully Consumed'!$L$2:$L$2003,'Data Items'!O42,'Fully Consumed'!$K$2:$K$2003)","v":9},null,"Palagetto","IT",{"$f":"SUMIF(Purchases!$A$3:$A$2002,'Data Items'!S42,Purchases!$M$3:$M$2002)","v":7},null,null,null,null,null,null,null,null,null,null,null,null,null,null,"Avg Age (Yrs, Days)",{"$f":"IF(SUM(Inventory!H2:H1001)>0,SUMPRODUCT(Inventory!H2:H1001,Inventory!F2:F1001)/SUM(Inventory!H2:H1001)/365,0)","v":6.6539899593034235},{"$f":"AK42*365","v":2428.7063351457496},null,null,"2009-12-23",486,4.0498418807983398,1478.192286491394,6.1178755760199692,0.2039291858673323,0.63333332538604736,11655.38,91.76]
[null,null,null,null,null,null,null,null,null,null,null,null,null,null,"Vendor 41",{"$f":"SUMIF(Purchases!$L$3:$L$2002,'Data Items'!O43,Purchases!$M$3:$M$2002)","v":0},{"$f":"SUMIF(Purchases!$L$3:$L$2002,'Data Items'!O43,Purchases!$K$3:$K$2002)+SUMIF('Fully Consumed'!$L$2:$L$2003,'Data Items'!O43,'Fully Consumed'!$K$2:$K$2003)","v":3},null,"Pelissero","IT",{"$f":"SUMIF(Purchases!$A$3:$A$2002,'Data Items'!S43,Purchases!$M$3:$M$2002)","v":9},null,null,null,null,null,null,null,null,null,null,null,null,null,null,"Inc Scr #",{"$f":"SUMIF(Purchases!$Q$3:$Q$2001,\">0\",Purchases!$M$3:$M$2001)","v":587},null,null,null,"2010-01-23",481,4.10398149490356,1497.9532456397994,19.760959148405391,0.63745029510985129,0.52666670083999634,11537.19,91.82]
[null,null,null,null,null,null,null,null,null,null,null,null,null,null,"Vendor 42",{"$f":"SUMIF(Purchases!$L$3:$L$2002,'Data Items'!O44,Purchases!$M$3:$M$2002)","v":8},{"$f":"SUMIF(Purchases!$L$3:$L$2002,'Data Items'!O44,Purchases!$K$3:$K$2002)+SUMIF('Fully Consumed'!$L$2:$L$2003,'Data Items'!O44,'Fully Consumed'!$K$2:$K$2003)","v":36},null,"Peter Lehmann","AU",{"$f":"SUMIF(Purchases!$A$3:$A$2002,'Data Items'!S44,Purchases!$M$3:$M$2002)","v":1},null,null,null,null,null,null,null,null,null,null,null,null,null,null,null,null,null,null,null,"2010-02-23",491,4.0946683883667001,1494.5539617538454,-3.3992838859539916,-0.10965431890174167,0.42999997735023499,11660.61,91.81]
[null,null,null,null,null,null,null,null,null,null,null,null,null,null,"Vendor 43",{"$f":"SUMIF(Purchases!$L$3:$L$2002,'Data Items'!O45,Purchases!$M$3:$M$2002)","v":10},{"$f":"SUMIF(Purchases!$L$3:$L$2002,'Data Items'!O45,Purchases!$K$3:$K$2002)+SUMIF('Fully Consumed'!$L$2:$L$2003,'Data Items'!O45,'Fully Consumed'!$K$2:$K$2003)","v":156},null,"Phillipe Delesvaux","FR",{"$f":"SUMIF(Purchases!$A$3:$A$2002,'Data Items'!S45,Purchases!$M$3:$M$2002)","v":3},null,null,null,null,null,null,null,null,null,null,null,null,null,null,"Reward Days Btls / Week",1,null,null,null,"2010-03-23",505,4.07259321212769,1486.4965224266068,-8.057439327238626,-0.28776569025852233,0.5,11779.53,91.75]
[null,null,null,null,null,null,null,null,null,null,null,null,null,null,"Vendor 44",{"$f":"SUMIF(Purchases!$L$3:$L$2002,'Data Items'!O46,Purchases!$M$3:$M$2002)","v":16},{"$f":"SUMIF(Purchases!$L$3:$L$2002,'Data Items'!O46,Purchases!$K$3:$K$2002)+SUMIF('Fully Consumed'!$L$2:$L$2003,'Data Items'!O46,'Fully Consumed'!$K$2:$K$2003)","v":24},null,"Pierre Amadieu","FR",{"$f":"SUMIF(Purchases!$A$3:$A$2002,'Data Items'!S46,Purchases!$M$3:$M$2002)","v":2},null,null,null,null,null,null,null,null,null,null,null,null,null,null,"Special Occasion Btls / Yr",10,null,null,null,"2010-04-23",524,4.0396232604980504,1474.4624900817885,-12.034032344818343,-0.38819459176833365,0.49333333969116211,11853.46,91.69]
[null,null,null,null,null,null,null,null,null,null,null,null,null,null,"Vendor 45",{"$f":"SUMIF(Purchases!$L$3:$L$2002,'Data Items'!O47,Purchases!$M$3:$M$2002)","v":5},{"$f":"SUMIF(Purchases!$L$3:$L$2002,'Data Items'!O47,Purchases!$K$3:$K$2002)+SUMIF('Fully Consumed'!$L$2:$L$2003,'Data Items'!O47,'Fully Consumed'!$K$2:$K$2003)","v":12},null,"Pillar Box","AU",{"$f":"SUMIF(Purchases!$A$3:$A$2002,'Data Items'!S47,Purchases!$M$3:$M$2002)","v":12},null,null,null,null,null,null,null,null,null,null,null,null,null,null,"Reward Days Total Btls",98,null,null,null,"2010-05-23",533,4.0731306076049796,1486.6926717758176,12.23018169402917,0.40767272313430569,0.476666659116745,12092.63,91.71]
[null,null,null,null,null,null,null,null,null,null,null,null,null,null,"Vendor 46",{"$f":"SUMIF(Purchases!$L$3:$L$2002,'Data Items'!O48,Purchases!$M$3:$M$2002)","v":0},{"$f":"SUMIF(Purchases!$L$3:$L$2002,'Data Items'!O48,Purchases!$K$3:$K$2002)+SUMIF('Fully Consumed'!$L$2:$L$2003,'Data Items'!O48,'Fully Consumed'!$K$2:$K$2003)","v":6},null,"Poggio il Castellare","IT",{"$f":"SUMIF(Purchases!$A$3:$A$2002,'Data Items'!S48,Purchases!$M$3:$M$2002)","v":6},null,null,null,null,null,null,null,null,null,null,null,null,null,null,"Special Occasion Total Btls",494,null,null,null,"2010-06-23",542,4.0929045677185103,1493.9101672172562,7.2174954414385866,0.23282243359479313,0.62333333492279053,12221.42,91.73]
[null,null,null,null,null,null,null,null,null,null,null,null,null,null,"Vendor 47",{"$f":"SUMIF(Purchases!$L$3:$L$2002,'Data Items'!O49,Purchases!$M$3:$M$2002)","v":0},{"$f":"SUMIF(Purchases!$L$3:$L$2002,'Data Items'!O49,Purchases!$K$3:$K$2002)+SUMIF('Fully Consumed'!$L$2:$L$2003,'Data Items'!O49,'Fully Consumed'!$K$2:$K$2003)","v":12},null,"Prats & Symington","PT",{"$f":"SUMIF(Purchases!$A$3:$A$2002,'Data Items'!S49,Purchases!$M$3:$M$2002)","v":5},null,null,null,null,null,null,null,null,null,null,null,null,null,null,"Score By",0,null,null,null,"2010-07-23",542,4.1804871559143102,1525.8778119087233,31.967644691467058,1.0655881563822354,0.40000000596046448,11812.43,91.87]
[null,null,null,null,null,null,null,null,null,null,null,null,null,null,"Vendor 48",{"$f":"SUMIF(Purchases!$L$3:$L$2002,'Data Items'!O50,Purchases!$M$3:$M$2002)","v":18},{"$f":"SUMIF(Purchases!$L$3:$L$2002,'Data Items'!O50,Purchases!$K$3:$K$2002)+SUMIF('Fully Consumed'!$L$2:$L$2003,'Data Items'!O50,'Fully Consumed'!$K$2:$K$2003)","v":52},null,"Proper Wines","US",{"$f":"SUMIF(Purchases!$A$3:$A$2002,'Data Items'!S50,Purchases!$M$3:$M$2002)","v":9},null,null,null,null,null,null,null,null,null,null,null,null,null,null,"Rater 1",null,null,null,null,"2010-08-23",532,4.2758727073669398,1560.693538188933,34.815726280209674,1.1230879445228927,0.52666670083999634,11666.47,91.91]
[null,null,null,null,null,null,null,null,null,null,null,null,null,null,"Vendor 49",{"$f":"SUMIF(Purchases!$L$3:$L$2002,'Data Items'!O51,Purchases!$M$3:$M$2002)","v":0},{"$f":"SUMIF(Purchases!$L$3:$L$2002,'Data Items'!O51,Purchases!$K$3:$K$2002)+SUMIF('Fully Consumed'!$L$2:$L$2003,'Data Items'!O51,'Fully Consumed'!$K$2:$K$2003)","v":9},null,"Punset","IT",{"$f":"SUMIF(Purchases!$A$3:$A$2002,'Data Items'!S51,Purchases!$M$3:$M$2002)","v":11},null,null,null,null,null,null,null,null,null,null,null,null,null,null,"Rater 2",null,null,null,null,"2010-09-23",554,4.2993869781494096,1569.2762470245345,8.5827088356015793,0.27686157534198641,0.46333333849906921,12011.2,91.89]
[null,null,null,null,null,null,null,null,null,null,null,null,null,null,"Vendor 50",{"$f":"SUMIF(Purchases!$L$3:$L$2002,'Data Items'!O52,Purchases!$M$3:$M$2002)","v":4},{"$f":"SUMIF(Purchases!$L$3:$L$2002,'Data Items'!O52,Purchases!$K$3:$K$2002)+SUMIF('Fully Consumed'!$L$2:$L$2003,'Data Items'!O52,'Fully Consumed'!$K$2:$K$2003)","v":7},null,"Quinta do Vale Meao","PT",{"$f":"SUMIF(Purchases!$A$3:$A$2002,'Data Items'!S52,Purchases!$M$3:$M$2002)","v":4},null,null,null,null,null,null,null,null,null,null,null,null,null,null,"Rater 3",null,null,null,null,"2010-10-23",547,4.3557009696960396,1589.8308539390544,20.554606914519809,0.68515356381732695,0.40000000596046448,11909.94,91.91]
[null,null,null,null,null,null,null,null,null,null,null,null,null,null,"Vendor 51",{"$f":"SUMIF(Purchases!$L$3:$L$2002,'Data Items'!O53,Purchases!$M$3:$M$2002)","v":0},{"$f":"SUMIF(Purchases!$L$3:$L$2002,'Data Items'!O53,Purchases!$K$3:$K$2002)+SUMIF('Fully Consumed'!$L$2:$L$2003,'Data Items'!O53,'Fully Consumed'!$K$2:$K$2003)","v":24},null,"Ravines","US",{"$f":"SUMIF(Purchases!$A$3:$A$2002,'Data Items'!S53,Purchases!$M$3:$M$2002)","v":5},null,null,null,null,null,null,null,null,null,null,null,null,null,null,"Rater 4",null,null,null,null,"2010-11-23",569,4.41678667068481,1612.1271347999557,22.296280860901334,0.71923486648068813,0.42999997735023499,12391.53,91.95]
[null,null,null,null,null,null,null,null,null,null,null,null,null,null,"Vendor 52",{"$f":"SUMIF(Purchases!$L$3:$L$2002,'Data Items'!O54,Purchases!$M$3:$M$2002)","v":0},{"$f":"SUMIF(Purchases!$L$3:$L$2002,'Data Items'!O54,Purchases!$K$3:$K$2002)+SUMIF('Fully Consumed'!$L$2:$L$2003,'Data Items'!O54,'Fully Consumed'!$K$2:$K$2003)","v":12},null,"Rex Hill","US",{"$f":"SUMIF(Purchases!$A$3:$A$2002,'Data Items'!S54,Purchases!$M$3:$M$2002)","v":7},null,null,null,null,null,null,null,null,null,null,null,null,null,null,"Rater 5",null,null,null,null,"2010-12-23",598,4.3536205291748002,1589.0714931488021,-23.055641651153564,-0.76852138837178552,0.37666666507720947,12934.66,92.07]
[null,null,null,null,null,null,null,null,null,null,null,null,null,null,"Vendor 53",{"$f":"SUMIF(Purchases!$L$3:$L$2002,'Data Items'!O55,Purchases!$M$3:$M$2002)","v":1},{"$f":"SUMIF(Purchases!$L$3:$L$2002,'Data Items'!O55,Purchases!$K$3:$K$2002)+SUMIF('Fully Consumed'!$L$2:$L$2003,'Data Items'!O55,'Fully Consumed'!$K$2:$K$2003)","v":4},null,"Reynvaan Family Vineyards","US",{"$f":"SUMIF(Purchases!$A$3:$A$2002,'Data Items'!S55,Purchases!$M$3:$M$2002)","v":5},null,null,null,null,null,null,null,null,null,null,null,null,null,null,"Purchases Sort Index",7,null,null,null,"2011-01-23",582,4.3917956352233896,1603.0054068565371,13.933913707734973,0.44948108734628944,0.78333330154418945,12829.03,92.15]
[null,null,null,null,null,null,null,null,null,null,null,null,null,null,"Vendor 54",{"$f":"SUMIF(Purchases!$L$3:$L$2002,'Data Items'!O56,Purchases!$M$3:$M$2002)","v":0},{"$f":"SUMIF(Purchases!$L$3:$L$2002,'Data Items'!O56,Purchases!$K$3:$K$2002)+SUMIF('Fully Consumed'!$L$2:$L$2003,'Data Items'!O56,'Fully Consumed'!$K$2:$K$2003)","v":48},null,"Riccardo Baracchi","IT",{"$f":"SUMIF(Purchases!$A$3:$A$2002,'Data Items'!S56,Purchases!$M$3:$M$2002)","v":11},null,null,null,null,null,null,null,null,null,null,null,null,null,null,"Inventory Sort Index",13,null,null,null,"2011-02-23",590,4.4236707687377903,1614.6398305892935,11.634423732756431,0.3753039913792397,0.50666666030883789,12973.14,92.17]
[null,null,null,null,null,null,null,null,null,null,null,null,null,null,"Vendor 55",{"$f":"SUMIF(Purchases!$L$3:$L$2002,'Data Items'!O57,Purchases!$M$3:$M$2002)","v":0},{"$f":"SUMIF(Purchases!$L$3:$L$2002,'Data Items'!O57,Purchases!$K$3:$K$2002)+SUMIF('Fully Consumed'!$L$2:$L$2003,'Data Items'!O57,'Fully Consumed'!$K$2:$K$2003)","v":12},null,"Rocland","AU",{"$f":"SUMIF(Purchases!$A$3:$A$2002,'Data Items'!S57,Purchases!$M$3:$M$2002)","v":1},null,null,null,null,null,null,null,null,null,null,null,null,null,null,"Filter Wine Colors",0,null,null,null,"2011-03-23",580,4.48648977279663,1637.56876707077,22.928936481476512,0.8188905886241612,0.5,12827.62,92.2]
[null,null,null,null,null,null,null,null,null,null,null,null,null,null,"Vendor 56",{"$f":"SUMIF(Purchases!$L$3:$L$2002,'Data Items'!O58,Purchases!$M$3:$M$2002)","v":11},{"$f":"SUMIF(Purchases!$L$3:$L$2002,'Data Items'!O58,Purchases!$K$3:$K$2002)+SUMIF('Fully Consumed'!$L$2:$L$2003,'Data Items'!O58,'Fully Consumed'!$K$2:$K$2003)","v":12},null,"San Filippo","IT",{"$f":"SUMIF(Purchases!$A$3:$A$2002,'Data Items'!S58,Purchases!$M$3:$M$2002)","v":5},null,null,null,null,null,null,null,null,null,null,null,null,null,null,"Filter Wine Varietals",0,null,null,null,"2011-04-23",581,4.53652095794678,1655.8301496505746,18.261382579804604,0.58907685741305171,0.47333332896232605,13030.07,92.29]
[null,null,null,null,null,null,null,null,null,null,null,null,null,null,"Vendor 57",{"$f":"SUMIF(Purchases!$L$3:$L$2002,'Data Items'!O59,Purchases!$M$3:$M$2002)","v":2},{"$f":"SUMIF(Purchases!$L$3:$L$2002,'Data Items'!O59,Purchases!$K$3:$K$2002)+SUMIF('Fully Consumed'!$L$2:$L$2003,'Data Items'!O59,'Fully Consumed'!$K$2:$K$2003)","v":48},null,"Schild","AU",{"$f":"SUMIF(Purchases!$A$3:$A$2002,'Data Items'!S59,Purchases!$M$3:$M$2002)","v":75},null,null,null,null,null,null,null,null,null,null,null,null,null,null,"Previous Custom Cat 1",null,null,null,null,"2011-05-23",578,4.5769529342651403,1670.5878210067763,14.757671356201627,0.49192237854005422,0.49000000953674316,13026.67,92.31]
[null,null,null,null,null,null,null,null,null,null,null,null,null,null,"Vendor 58",{"$f":"SUMIF(Purchases!$L$3:$L$2002,'Data Items'!O60,Purchases!$M$3:$M$2002)","v":2},{"$f":"SUMIF(Purchases!$L$3:$L$2002,'Data Items'!O60,Purchases!$K$3:$K$2002)+SUMIF('Fully Consumed'!$L$2:$L$2003,'Data Items'!O60,'Fully Consumed'!$K$2:$K$2003)","v":3},null,"Schloss Lieser","DE",{"$f":"SUMIF(Purchases!$A$3:$A$2002,'Data Items'!S60,Purchases!$M$3:$M$2002)","v":7},null,null,null,null,null,null,null,null,null,null,null,null,null,null,"Previous Custom Cat 2",null,null,null,null,"2011-06-23",582,4.5927047729492196,1676.3372421264651,5.7494211196888045,0.18546519740931627,0.53666669130325317,13016.1,92.25]
[null,null,null,null,null,null,null,null,null,null,null,null,null,null,"Vendor 59",{"$f":"SUMIF(Purchases!$L$3:$L$2002,'Data Items'!O61,Purchases!$M$3:$M$2002)","v":55},{"$f":"SUMIF(Purchases!$L$3:$L$2002,'Data Items'!O61,Purchases!$K$3:$K$2002)+SUMIF('Fully Consumed'!$L$2:$L$2003,'Data Items'!O61,'Fully Consumed'!$K$2:$K$2003)","v":138},null,"Seghesio","US",{"$f":"SUMIF(Purchases!$A$3:$A$2002,'Data Items'!S61,Purchases!$M$3:$M$2002)","v":1},null,null,null,null,null,null,null,null,null,null,null,null,null,null,"Sort Shopping List By",0,null,null,null,"2011-07-23",603,4.5880637168884304,1674.643256664277,-1.6939854621880386,-5.646618207293462E-2,0.5,13267.44,92.2]
[null,null,null,null,null,null,null,null,null,null,null,null,null,null,"Vendor 60",{"$f":"SUMIF(Purchases!$L$3:$L$2002,'Data Items'!O62,Purchases!$M$3:$M$2002)","v":24},{"$f":"SUMIF(Purchases!$L$3:$L$2002,'Data Items'!O62,Purchases!$K$3:$K$2002)+SUMIF('Fully Consumed'!$L$2:$L$2003,'Data Items'!O62,'Fully Consumed'!$K$2:$K$2003)","v":36},null,"Shingleback","AU",{"$f":"SUMIF(Purchases!$A$3:$A$2002,'Data Items'!S62,Purchases!$M$3:$M$2002)","v":2},null,null,null,null,null,null,null,null,null,null,null,null,null,null,"Last Recommended Wine",12,null,null,null,"2011-08-23",603,4.6453127861022896,1695.5391669273356,20.895910263058568,0.67406162138898607,0.47333332896232605,13364.95,92.21]
[null,null,null,null,null,null,null,null,null,null,null,null,null,null,"Vendor 61",{"$f":"SUMIF(Purchases!$L$3:$L$2002,'Data Items'!O63,Purchases!$M$3:$M$2002)","v":0},{"$f":"SUMIF(Purchases!$L$3:$L$2002,'Data Items'!O63,Purchases!$K$3:$K$2002)+SUMIF('Fully Consumed'!$L$2:$L$2003,'Data Items'!O63,'Fully Consumed'!$K$2:$K$2003)","v":12},null,"Symington Family","PT",{"$f":"SUMIF(Purchases!$A$3:$A$2002,'Data Items'!S63,Purchases!$M$3:$M$2002)","v":7},null,null,null,null,null,null,null,null,null,null,null,null,null,null,"Show Inventory Option",2,null,null,null,"2011-09-23",609,4.7210631370544398,1723.1880450248705,27.648878097534862,0.89189929346886654,0.5899999737739563,13817.11,92.26]
[null,null,null,null,null,null,null,null,null,null,null,null,null,null,"Vendor 62",{"$f":"SUMIF(Purchases!$L$3:$L$2002,'Data Items'!O64,Purchases!$M$3:$M$2002)","v":0},{"$f":"SUMIF(Purchases!$L$3:$L$2002,'Data Items'!O64,Purchases!$K$3:$K$2002)+SUMIF('Fully Consumed'!$L$2:$L$2003,'Data Items'!O64,'Fully Consumed'!$K$2:$K$2003)","v":12},null,"Tensley","US",{"$f":"SUMIF(Purchases!$A$3:$A$2002,'Data Items'!S64,Purchases!$M$3:$M$2002)","v":5},null,null,null,null,null,null,null,null,null,null,null,null,null,null,null,null,null,null,null,"2011-10-23",601,4.7587838172912598,1736.9560933113098,13.768048286439353,0.45893494288131176,0.66666668653488159,13744.31,92.31]
[null,null,null,null,null,null,null,null,null,null,null,null,null,null,"Vendor 63",{"$f":"SUMIF(Purchases!$L$3:$L$2002,'Data Items'!O65,Purchases!$M$3:$M$2002)","v":0},{"$f":"SUMIF(Purchases!$L$3:$L$2002,'Data Items'!O65,Purchases!$K$3:$K$2002)+SUMIF('Fully Consumed'!$L$2:$L$2003,'Data Items'!O65,'Fully Consumed'!$K$2:$K$2003)","v":19},null,"Terrabianca","IT",{"$f":"SUMIF(Purchases!$A$3:$A$2002,'Data Items'!S65,Purchases!$M$3:$M$2002)","v":2},null,null,null,null,null,null,null,null,null,null,null,null,null,null,null,null,null,null,null,"2011-11-23",628,4.7014088630676296,1716.0142350196847,-20.941858291625067,-0.67554381585887313,0.57999998331069946,14401.47,92.32]
[null,null,null,null,null,null,null,null,null,null,null,null,null,null,"Vendor 64",{"$f":"SUMIF(Purchases!$L$3:$L$2002,'Data Items'!O66,Purchases!$M$3:$M$2002)","v":21},{"$f":"SUMIF(Purchases!$L$3:$L$2002,'Data Items'!O66,Purchases!$K$3:$K$2002)+SUMIF('Fully Consumed'!$L$2:$L$2003,'Data Items'!O66,'Fully Consumed'!$K$2:$K$2003)","v":132},null,"Thorn Clarke","AU",{"$f":"SUMIF(Purchases!$A$3:$A$2002,'Data Items'!S66,Purchases!$M$3:$M$2002)","v":2},null,null,null,null,null,null,null,null,null,null,null,null,null,null,null,null,null,null,null,"2011-12-23",621,4.7383217811584499,1729.4874501228342,13.473215103149414,0.44910717010498047,0.77666664123535156,14127.33,92.31]
[null,null,null,null,null,null,null,null,null,null,null,null,null,null,"Vendor 65",{"$f":"SUMIF(Purchases!$L$3:$L$2002,'Data Items'!O67,Purchases!$M$3:$M$2002)","v":25},{"$f":"SUMIF(Purchases!$L$3:$L$2002,'Data Items'!O67,Purchases!$K$3:$K$2002)+SUMIF('Fully Consumed'!$L$2:$L$2003,'Data Items'!O67,'Fully Consumed'!$K$2:$K$2003)","v":156},null,"Tommasi","IT",{"$f":"SUMIF(Purchases!$A$3:$A$2002,'Data Items'!S67,Purchases!$M$3:$M$2002)","v":12},null,null,null,null,null,null,null,null,null,null,null,null,null,null,null,null,null,null,null,"2012-01-23",610,4.8080544471740696,1754.9398732185355,25.452423095701306,0.82104590631294538,0.60333329439163208,13973.02,92.36]
[null,null,null,null,null,null,null,null,null,null,null,null,null,null,"Vendor 66",{"$f":"SUMIF(Purchases!$L$3:$L$2002,'Data Items'!O68,Purchases!$M$3:$M$2002)","v":28},{"$f":"SUMIF(Purchases!$L$3:$L$2002,'Data Items'!O68,Purchases!$K$3:$K$2002)+SUMIF('Fully Consumed'!$L$2:$L$2003,'Data Items'!O68,'Fully Consumed'!$K$2:$K$2003)","v":36},null,"Torzi Matthews","AU",{"$f":"SUMIF(Purchases!$A$3:$A$2002,'Data Items'!S68,Purchases!$M$3:$M$2002)","v":2},null,null,null,null,null,null,null,null,null,null,null,null,null,null,null,null,null,null,null,"2012-02-23",616,4.82295799255371,1760.3796672821043,5.4397940635687974,0.17547722785705797,0.72000002861022949,14138.97,92.4]
[null,null,null,null,null,null,null,null,null,null,null,null,null,null,"Vendor 67",{"$f":"SUMIF(Purchases!$L$3:$L$2002,'Data Items'!O69,Purchases!$M$3:$M$2002)","v":0},{"$f":"SUMIF(Purchases!$L$3:$L$2002,'Data Items'!O69,Purchases!$K$3:$K$2002)+SUMIF('Fully Consumed'!$L$2:$L$2003,'Data Items'!O69,'Fully Consumed'!$K$2:$K$2003)","v":12},null,"Turley","US",{"$f":"SUMIF(Purchases!$A$3:$A$2002,'Data Items'!S69,Purchases!$M$3:$M$2002)","v":4},null,null,null,null,null,null,null,null,null,null,null,null,null,null,null,null,null,null,null,"2012-03-23",628,4.7960114479064897,1750.5441784858688,-9.8354887962354951,-0.33915478607708605,0.69999998807907104,14304.09,92.37]
[null,null,null,null,null,null,null,null,null,null,null,null,null,null,"Vendor 68",{"$f":"SUMIF(Purchases!$L$3:$L$2002,'Data Items'!O70,Purchases!$M$3:$M$2002)","v":0},{"$f":"SUMIF(Purchases!$L$3:$L$2002,'Data Items'!O70,Purchases!$K$3:$K$2002)+SUMIF('Fully Consumed'!$L$2:$L$2003,'Data Items'!O70,'Fully Consumed'!$K$2:$K$2003)","v":6},null,"Two Hands","AU",{"$f":"SUMIF(Purchases!$A$3:$A$2002,'Data Items'!S70,Purchases!$M$3:$M$2002)","v":4},null,null,null,null,null,null,null,null,null,null,null,null,null,null,null,null,null,null,null,"2012-04-23",636,4.8209214210510298,1759.6363186836259,9.0921401977570895,0.29329484508893838,0.63333332538604736,14489.82,92.39]
[null,null,null,null,null,null,null,null,null,null,null,null,null,null,"Vendor 69",{"$f":"SUMIF(Purchases!$L$3:$L$2002,'Data Items'!O71,Purchases!$M$3:$M$2002)","v":0},{"$f":"SUMIF(Purchases!$L$3:$L$2002,'Data Items'!O71,Purchases!$K$3:$K$2002)+SUMIF('Fully Consumed'!$L$2:$L$2003,'Data Items'!O71,'Fully Consumed'!$K$2:$K$2003)","v":24},null,"Tyrus Evan","US",{"$f":"SUMIF(Purchases!$A$3:$A$2002,'Data Items'!S71,Purchases!$M$3:$M$2002)","v":5},null,null,null,null,null,null,null,null,null,null,null,null,null,null,null,null,null,null,null,"2012-05-23",650,4.8536086082458496,1771.5671420097351,11.930823326109248,0.39769411087030826,0.45666667819023132,14852.18,92.37]
[null,null,null,null,null,null,null,null,null,null,null,null,null,null,"Vendor 70",{"$f":"SUMIF(Purchases!$L$3:$L$2002,'Data Items'!O72,Purchases!$M$3:$M$2002)","v":0},{"$f":"SUMIF(Purchases!$L$3:$L$2002,'Data Items'!O72,Purchases!$K$3:$K$2002)+SUMIF('Fully Consumed'!$L$2:$L$2003,'Data Items'!O72,'Fully Consumed'!$K$2:$K$2003)","v":12},null,"Vignerons de Caractere","FR",{"$f":"SUMIF(Purchases!$A$3:$A$2002,'Data Items'!S72,Purchases!$M$3:$M$2002)","v":2},null,null,null,null,null,null,null,null,null,null,null,null,null,null,null,null,null,null,null,"2012-06-23",669,4.8139381408691397,1757.0874214172361,-14.479720592499007,-0.46708776104835503,0.56999999284744263,15087.45,92.33]
[null,null,null,null,null,null,null,null,null,null,null,null,null,null,"Vendor 71",{"$f":"SUMIF(Purchases!$L$3:$L$2002,'Data Items'!O73,Purchases!$M$3:$M$2002)","v":7},{"$f":"SUMIF(Purchases!$L$3:$L$2002,'Data Items'!O73,Purchases!$K$3:$K$2002)+SUMIF('Fully Consumed'!$L$2:$L$2003,'Data Items'!O73,'Fully Consumed'!$K$2:$K$2003)","v":21},null,"Vina Herminia","ES",{"$f":"SUMIF(Purchases!$A$3:$A$2002,'Data Items'!S73,Purchases!$M$3:$M$2002)","v":12},null,null,null,null,null,null,null,null,null,null,null,null,null,null,null,null,null,null,null,"2012-07-23",651,4.94395208358765,1804.5425105094923,47.45508909225623,1.5818363030752076,0.73333334922790527,14807.42,92.38]
[null,null,null,null,null,null,null,null,null,null,null,null,null,null,"Vendor 72",{"$f":"SUMIF(Purchases!$L$3:$L$2002,'Data Items'!O74,Purchases!$M$3:$M$2002)","v":5},{"$f":"SUMIF(Purchases!$L$3:$L$2002,'Data Items'!O74,Purchases!$K$3:$K$2002)+SUMIF('Fully Consumed'!$L$2:$L$2003,'Data Items'!O74,'Fully Consumed'!$K$2:$K$2003)","v":12},null,"Vina Santa Rita","AR",{"$f":"SUMIF(Purchases!$A$3:$A$2002,'Data Items'!S74,Purchases!$M$3:$M$2002)","v":18},null,null,null,null,null,null,null,null,null,null,null,null,null,null,null,null,null,null,null,"2012-08-23",645,4.9945435523986799,1823.0083966255181,18.465886116025786,0.59567374567825115,0.68666666746139526,14816.82,92.42]
[null,null,null,null,null,null,null,null,null,null,null,null,null,null,"Vendor 73",{"$f":"SUMIF(Purchases!$L$3:$L$2002,'Data Items'!O75,Purchases!$M$3:$M$2002)","v":1},{"$f":"SUMIF(Purchases!$L$3:$L$2002,'Data Items'!O75,Purchases!$K$3:$K$2002)+SUMIF('Fully Consumed'!$L$2:$L$2003,'Data Items'!O75,'Fully Consumed'!$K$2:$K$2003)","v":9},null,"Vinos de Arganza","ES",{"$f":"SUMIF(Purchases!$A$3:$A$2002,'Data Items'!S75,Purchases!$M$3:$M$2002)","v":20},null,null,null,null,null,null,null,null,null,null,null,null,null,null,null,null,null,null,null,"2012-09-23",672,5.0120291709899902,1829.3906474113464,6.3822507858283188,0.20587905760736513,0.68666666746139526,15285.74,92.42]
[null,null,null,null,null,null,null,null,null,null,null,null,null,null,"Vendor 74",{"$f":"SUMIF(Purchases!$L$3:$L$2002,'Data Items'!O76,Purchases!$M$3:$M$2002)","v":4},{"$f":"SUMIF(Purchases!$L$3:$L$2002,'Data Items'!O76,Purchases!$K$3:$K$2002)+SUMIF('Fully Consumed'!$L$2:$L$2003,'Data Items'!O76,'Fully Consumed'!$K$2:$K$2003)","v":6},null,"Vinosia","IT",{"$f":"SUMIF(Purchases!$A$3:$A$2002,'Data Items'!S76,Purchases!$M$3:$M$2002)","v":10},null,null,null,null,null,null,null,null,null,null,null,null,null,null,null,null,null,null,null,"2012-10-23",668,5.0564389228820801,1845.6002068519592,16.209559440612793,0.5403186480204264,0.65666669607162476,15387.9,92.48]
[null,null,null,null,null,null,null,null,null,null,null,null,null,null,"Vendor 75",{"$f":"SUMIF(Purchases!$L$3:$L$2002,'Data Items'!O77,Purchases!$M$3:$M$2002)","v":12},{"$f":"SUMIF(Purchases!$L$3:$L$2002,'Data Items'!O77,Purchases!$K$3:$K$2002)+SUMIF('Fully Consumed'!$L$2:$L$2003,'Data Items'!O77,'Fully Consumed'!$K$2:$K$2003)","v":12},null,"Viticcio","IT",{"$f":"SUMIF(Purchases!$A$3:$A$2002,'Data Items'!S77,Purchases!$M$3:$M$2002)","v":9},null,null,null,null,null,null,null,null,null,null,null,null,null,null,null,null,null,null,null,"2012-11-23",660,5.1199679374694798,1868.7882971763602,23.188090324400946,0.7480029136903531,0.52666670083999634,15433.48,92.51]
[null,null,null,null,null,null,null,null,null,null,null,null,null,null,"Vendor 76",{"$f":"SUMIF(Purchases!$L$3:$L$2002,'Data Items'!O78,Purchases!$M$3:$M$2002)","v":0},{"$f":"SUMIF(Purchases!$L$3:$L$2002,'Data Items'!O78,Purchases!$K$3:$K$2002)+SUMIF('Fully Consumed'!$L$2:$L$2003,'Data Items'!O78,'Fully Consumed'!$K$2:$K$2003)","v":12},null,null,null,null,null,null,null,null,null,null,null,null,null,null,null,null,null,null,null,null,null,null,null,"2012-12-23",665,5.1386871337890598,1875.6208038330069,6.8325066566467285,0.22775022188822427,0.5,15515.43,92.56]
[null,null,null,null,null,null,null,null,null,null,null,null,null,null,"Other",{"$f":"SUM(Purchases!M$3:M9956)-SUM(P$3:P78)","v":0},{"$f":"SUM(Purchases!K$3:K9956)+SUM('Fully Consumed'!L$2:L9956)-SUM(Q$3:Q78)","v":-1379},null,null,null,null,null,null,null,null,null,null,null,null,null,null,null,null,null,null,null,null,null,null,null,"2013-01-23",659,5.2180914878845197,1904.6033930778497,28.982589244842757,0.93492223370460503,0.51666665077209473,15515.99,92.59]
[null,null,null,null,null,null,null,null,null,null,null,null,null,null,null,null,null,null,null,null,null,null,null,null,null,null,null,null,null,null,null,null,null,null,null,null,null,null,null,null,"2013-02-23",655,5.3014030456543004,1935.0121116638197,30.408718585970064,0.98092640599903436,0.46333333849906921,15449.4,92.61]
[null,null,null,null,null,null,null,null,null,null,null,null,null,null,null,null,null,null,null,null,null,null,null,null,null,null,null,null,null,null,null,null,null,null,null,null,null,null,null,null,"2013-03-23",653,5.3589153289794904,1956.004095077514,20.991983413694243,0.74971369334622295,0.48666667938232422,15712.45,92.65]
[null,null,null,null,null,null,null,null,null,null,null,null,null,null,null,null,null,null,null,null,null,null,null,null,null,null,null,null,null,null,null,null,null,null,null,null,null,null,null,null,"2013-04-23",687,5.2751321792602504,1925.4232454299913,-30.580849647522655,-0.98647902088782757,0.31333333253860474,17569.84,92.69]
[null,null,null,null,null,null,null,null,null,null,null,null,null,null,null,null,null,null,null,null,null,null,null,null,null,null,null,null,null,null,null,null,null,null,null,null,null,null,null,null,"2013-05-23",679,5.3347272872924796,1947.1754598617551,21.752214431763832,0.7250738143921277,0.40000000596046448,17413.560000000001,92.7]
[null,null,null,null,null,null,null,null,null,null,null,null,null,null,null,null,null,null,null,null,null,null,null,null,null,null,null,null,null,null,null,null,null,null,null,null,null,null,null,null,"2013-06-23",679,5.4009227752685502,1971.3368129730209,24.161353111265726,0.7793984874601847,0.2800000011920929,17486.71,92.73]
[null,null,null,null,null,null,null,null,null,null,null,null,null,null,null,null,null,null,null,null,null,null,null,null,null,null,null,null,null,null,null,null,null,null,null,null,null,null,null,null,"2013-07-24",663,5.4861268997192401,2002.4363183975227,31.099505424501785,1.0032098524032833,0.50666666030883789,17212.52,92.75]
[null,null,null,null,null,null,null,null,null,null,null,null,null,null,null,null,null,null,null,null,null,null,null,null,null,null,null,null,null,null,null,null,null,null,null,null,null,null,null,null,"2013-08-23",663,5.5803327560424796,2036.8214559555051,34.385137557982489,1.1461712519327496,0.54333335161209106,17383.98,92.81]
[null,null,null,null,null,null,null,null,null,null,null,null,null,null,null,null,null,null,null,null,null,null,null,null,null,null,null,null,null,null,null,null,null,null,null,null,null,null,null,null,"2013-09-23",648,5.6569352149963397,{"$f":"AQ87*365","v":2064.7813534736638},{"$f":"AR87-AR86","v":27.959897518158641},{"$f":"AS87/(AO87-AO86)","v":0.90193217800511749},0.61333334445953369,17117.75,92.83]
[null,null,null,null,null,null,null,null,null,null,null,null,null,null,null,null,null,null,null,null,null,null,null,null,null,null,null,null,null,null,null,null,null,null,null,null,null,null,null,null,"2013-10-23",628,5.7528738975524902,2099.7989726066589,35.017619132995151,1.1672539710998384,0.66666668653488159,16774.830000000002,92.88]
[null,null,null,null,null,null,null,null,null,null,null,null,null,null,null,null,null,null,null,null,null,null,null,null,null,null,null,null,null,null,null,null,null,null,null,null,null,null,null,null,"2013-11-23",633,5.7423543930053702,2095.95935344696,-3.8396191596989411,-0.12385868257093359,0.66666668653488159,17257.650000000001,92.88]
[null,null,null,null,null,null,null,null,null,null,null,null,null,null,null,null,null,null,null,null,null,null,null,null,null,null,null,null,null,null,null,null,null,null,null,null,null,null,null,null,"2013-12-23",626,5.76529741287231,2104.333555698393,8.3742022514329619,0.27914007504776539,0.6433333158493042,17072.95,92.88]
[null,null,null,null,null,null,null,null,null,null,null,null,null,null,null,null,null,null,null,null,null,null,null,null,null,null,null,null,null,null,null,null,null,null,null,null,null,null,null,null,"2014-01-23",610,5.8654756546020499,2140.8986139297481,36.565058231355124,1.1795180074630685,0.66666668653488159,16802.939999999999,92.93]
[null,null,null,null,null,null,null,null,null,null,null,null,null,null,null,null,null,null,null,null,null,null,null,null,null,null,null,null,null,null,null,null,null,null,null,null,null,null,null,null,"2014-02-23",609,5.8651552200317401,2140.7816553115849,-0.11695861816315301,-3.7728586504242904E-3,0.56000000238418579,16731.93,92.93]
[null,null,null,null,null,null,null,null,null,null,null,null,null,null,null,null,null,null,null,null,null,null,null,null,null,null,null,null,null,null,null,null,null,null,null,null,null,null,null,null,"2014-03-23",611,5.8029718399047896,2118.0847215652484,-22.696933746336526,-0.81060477665487596,0.62999999523162842,16637.37,92.88]
[null,null,null,null,null,null,null,null,null,null,null,null,null,null,null,null,null,null,null,null,null,null,null,null,null,null,null,null,null,null,null,null,null,null,null,null,null,null,null,null,"2014-04-23",615,5.7549810409545898,2100.5680799484253,-17.516641616823108,-0.56505295538139055,0.75333333015441895,16902.79,92.89]
[null,null,null,null,null,null,null,null,null,null,null,null,null,null,null,null,null,null,null,null,null,null,null,null,null,null,null,null,null,null,null,null,null,null,null,null,null,null,null,null,"2014-05-23",632,5.6971421241760298,2079.4568753242511,-21.111204624174206,-0.70370682080580693,0.55666667222976685,17252.46,92.87]
[null,null,null,null,null,null,null,null,null,null,null,null,null,null,null,null,null,null,null,null,null,null,null,null,null,null,null,null,null,null,null,null,null,null,null,null,null,null,null,null,"2014-06-27",632,5.6992268562316903,2080.2178025245671,0.76092720031601857,2.1740777151886246E-2,0.68666666746139526,17340.5,92.9]
[null,null,null,null,null,null,null,null,null,null,null,null,null,null,null,null,null,null,null,null,null,null,null,null,null,null,null,null,null,null,null,null,null,null,null,null,null,null,null,null,"2014-07-23",626,5.7529110908508301,2099.812548160553,19.594745635985873,0.75364406292253361,0.56333333253860474,17250.080000000002,92.94]
[null,null,null,null,null,null,null,null,null,null,null,null,null,null,null,null,null,null,null,null,null,null,null,null,null,null,null,null,null,null,null,null,null,null,null,null,null,null,null,null,"2014-08-23",617,5.8336453437805202,2129.2805504798898,29.468002319336847,0.95058071997860794,0.27000001072883606,17149.12,93.01]
[null,null,null,null,null,null,null,null,null,null,null,null,null,null,null,null,null,null,null,null,null,null,null,null,null,null,null,null,null,null,null,null,null,null,null,null,null,null,null,null,"2014-09-24",612,5.8985037803649902,{"$f":"AQ99*365","v":2152.9538798332214},{"$f":"AR99-AR98","v":23.67332935333161},{"$f":"AS99/(AO99-AO98)","v":0.73979154229161281},0.42666664719581604,16953.84,93]
[null,null,null,null,null,null,null,null,null,null,null,null,null,null,null,null,null,null,null,null,null,null,null,null,null,null,null,null,null,null,null,null,null,null,null,null,null,null,null,null,"2014-10-23",606,5.9349656105041504,2166.2624478340149,13.308568000793457,0.45891613795839509,0.53000003099441528,17163.599999999999,93.03]
[null,null,null,null,null,null,null,null,null,null,null,null,null,null,null,null,null,null,null,null,null,null,null,null,null,null,null,null,null,null,null,null,null,null,null,null,null,null,null,null,"2014-11-23",623,5.8532953262329102,2136.4527940750122,-29.809653759002686,-0.96160173416137695,0.52666670083999634,18534.96,93]
[null,null,null,null,null,null,null,null,null,null,null,null,null,null,null,null,null,null,null,null,null,null,null,null,null,null,null,null,null,null,null,null,null,null,null,null,null,null,null,null,"2014-12-24",605,5.9582858085632298,2174.7743201255789,38.321526050566717,1.2361782596957005,0.63333332538604736,18195.23,93.02]
[null,null,null,null,null,null,null,null,null,null,null,null,null,null,null,null,null,null,null,null,null,null,null,null,null,null,null,null,null,null,null,null,null,null,null,null,null,null,null,null,"2015-01-23",588,6.0682544708251998,2214.9128818511981,40.138561725619184,1.3379520575206394,0.56666666269302368,17727.84,93.05]
[null,null,null,null,null,null,null,null,null,null,null,null,null,null,null,null,null,null,null,null,null,null,null,null,null,null,null,null,null,null,null,null,null,null,null,null,null,null,null,null,"2015-02-23",569,6.1681237220764196,2251.3651585578932,36.452276706695102,1.1758798937643582,0.60333329439163208,17301.91,93.08]
[null,null,null,null,null,null,null,null,null,null,null,null,null,null,null,null,null,null,null,null,null,null,null,null,null,null,null,null,null,null,null,null,null,null,null,null,null,null,null,null,"2015-03-23",557,6.2376332283020002,2276.7361283302303,25.370969772337048,0.90610606329775167,0.58333331346511841,17398.46,93.11]
[null,null,null,null,null,null,null,null,null,null,null,null,null,null,null,null,null,null,null,null,null,null,null,null,null,null,null,null,null,null,null,null,null,null,null,null,null,null,null,null,"2015-04-23",574,6.1116957664489702,2230.7689547538739,-45.967173576356345,-1.4828120508502047,0.5899999737739563,18444.77,93.12]
[null,null,null,null,null,null,null,null,null,null,null,null,null,null,null,null,null,null,null,null,null,null,null,null,null,null,null,null,null,null,null,null,null,null,null,null,null,null,null,null,"2015-05-23",558,6.2234187126159703,2271.5478301048292,40.778875350955332,1.3592958450318444,0.5899999737739563,18145.439999999999,93.16]
[null,null,null,null,null,null,null,null,null,null,null,null,null,null,null,null,null,null,null,null,null,null,null,null,null,null,null,null,null,null,null,null,null,null,null,null,null,null,null,null,"2015-06-23",574,6.2112579345703098,2267.1091461181632,-4.4386839866660921,-0.14318335440858362,0.53666669130325317,18321.54,93.08]
[null,null,null,null,null,null,null,null,null,null,null,null,null,null,null,null,null,null,null,null,null,null,null,null,null,null,null,null,null,null,null,null,null,null,null,null,null,null,null,null,"2015-07-25",560,6.32387447357178,2308.2141828536996,41.105036735536487,1.2845323979855152,0.46000000834465027,18042.73,93.11]
[null,null,null,null,null,null,null,null,null,null,null,null,null,null,null,null,null,null,null,null,null,null,null,null,null,null,null,null,null,null,null,null,null,null,null,null,null,null,null,null,"2015-08-23",544,6.4109807014465332,{"$f":"AQ110*365","v":2340.0079560279846},{"$f":"AR110-AR109","v":31.793773174284979},{"$f":"AS110/(AO110-AO109)","v":1.096337006009827},0.54000002145767212,17731.900000000001,93.17,287]

{"sheet":"Fully Consumed","index":29,"n_rows":121,"n_cols":72,"rows_kept":121,"cut":false,"hidden":false,"merged":[]}
["Winery","Year","Detailed Varietal Info","Varietal Type","Name","Btl Sz","Price (incl)","Score"," Purchase Date","Cellar Date","Bottles","Purchased From","On-Hand","Val OH","Inc $","Inc Scr","Scr*Inc","Bin #","Closure","# Corked","Combined Reference","Finish Date","Unusd","Date 1","Taste Note 1","Date 2","Taste Note 2","Date 3","Taste Note 3","Date 4","Taste Note 4","Date 5","Taste Note 5","Date 6","Taste Note 6","Date 7","Taste Note 7","Date 8","Taste Note 8","Date 9","Taste Note 9","Date 10","Taste Note 10","Date 11","Taste Note 11","Date 12","Taste Note 12","Date 13","Taste Note 13","Date 14","Taste Note 14","Date 15","Taste Note 15","Date 16","Taste Note 16","Date 17","Taste Note 17","Date 18","Taste Note 18","Date 19","Taste Note 19","Date 20","Taste Note 20","Date 21","Taste Note 21","Date 22","Taste Note 22","Date 23","Taste Note 23","Date 24","Taste Note 24","Shipping Method"]
["Bodegas Felix Callejo",2005,"Tempranillo Blend","Tempranillo Blend","Ribera del Duero Crianza",0.75,26.431729981899259,93,"2008-04-29","2008-04-29",12,"Vendor 47",0,{"$f":"M2*G2","v":0},1,1,{"$f":"H2*P2","v":93},null,"Cork (TBD)",0,null,"2015-09-10"]
["Tertulia Cellars",2012,"Syrah","Shiraz/Syrah","Reserve Estate Syrah",0.75,47.531756572723388,90,"2014-06-22","2014-10-29",6,"Vendor 46",0,0,1,1,90,null,null,0,null,"2015-09-09"]
["Limerick Lane",2014,"Furmint","Furmint","Dry Furmint White Russian River Valley",0.75,43.716583633333443,90,"2015-05-18","2015-06-10",1,"Vendor 24",0,0,1,1,90,null,null,0,null,"2015-08-23"]
["Bodegas Eguren",2009,"Cab S","Cab S","Viño de la Tierra de Castilla Mercedes Eguren",0.75,10.206321415483952,90,"2012-04-06","2012-04-11",12,"Vendor 67",0,0,1,1,90,null,null,0,null,"2015-08-22"]
["Turley",2013,"Zinfandel","Zinfandel","Zinfandel Cobb Vineyard",0.75,33.943070286512381,92,"2015-01-27","2015-04-14",1,"Vendor 50",0,0,1,1,92,null,null,0,null,"2015-08-02"]
["Borgo Scopeto",2010,"Sangiovese","Sangiovese","Chianti Classico",0.75,16.138915684580802,92,"2014-05-07","2014-05-14",12,"Vendor 38",0,0,1,1,92,null,null,0,null,"2015-07-28"]
["Schild",2009,"Shiraz","Shiraz/Syrah","Barossa",0.75,15.263564067274332,92,"2012-02-19","2012-02-22",24,"Vendor 65",0,0,1,1,92,null,"Screwtop",0,null,"2015-07-18"]
["Loosen Bros",2012,"Riesling","Riesling","Dr. L Riesling",0.75,10.624010426700114,91,"2014-02-06","2014-02-11",12,"Vendor 13",0,0,1,1,91,null,null,0,null,"2015-07-04"]
["Vina Ninquen",2009,"Syrah","Shiraz/Syrah","Syrah Colchagua Valley Antu",0.75,15.09659164172411,91,"2013-10-30","2013-11-06",12,"Vendor 48",0,0,1,1,91,null,null,0,null,"2015-06-10"]
["Mark Ryan",2012,"Syrah (58), Grenache (26), Mouvedre (16)","Shiraz/Syrah Blend","Numbskull GSM",0.75,32.05276583266258,90,"2014-06-22","2014-09-30",4,"Vendor 29",0,0,1,1,90,null,null,0,null,"2015-05-24"]
["Schild",2012,"Grenache (45), Mouvedre (28), Syrah (27)","Grenache Blend","GMS",0.75,10.108376559317112,90,"2014-08-26","2014-08-28",12,"Vendor 48",0,0,1,1,90,null,null,0,null,"2015-05-09"]
["Turley",2013,"Zinfandel","Zinfandel","Zinfandel Estate Napa Valley",0.75,50.499184587478638,94,"2015-01-27","2015-04-14",1,"Vendor 50",0,0,1,1,94,null,null,0,null,"2015-04-30"]
["Mocali di Ciacci Tiziano",2009,"Sangiovese, Malvasia Bianca, Alicante Bouschet","Sangiovese Blend","Morellino di Scansano",0.75,13.331803566277028,94,"2011-11-17","2011-11-21",24,"Vendor 54",0,0,1,1,94,null,null,0,null,"2015-04-23"]
["Bodegas Aragonesas",2012,"Grenache","Grenache","Garnacha Campo de Borja Coto de Hayas Centenaria",0.75,13.928004829645158,91,"2014-06-06","2014-06-06",12,"Vendor 36",0,0,1,1,91,null,null,0,null,"2015-04-16"]
["Turley",2013,"Zinfandel","Zinfandel","Zinfandel Kirshenmann Vineyard",0.75,42.212107057571409,92,"2015-01-27","2015-04-14",1,"Vendor 50",0,0,1,1,92,null,null,0,null,"2015-04-14"]
["Carlisle",2013,"Petite Sirah","Petite Sirah","Napa Valley \"Palisades Vineyard\" Petite Sirah",0.75,52.472755755126478,92,"2015-01-21","2015-04-10",2,"Vendor 8",0,0,1,1,92,null,null,0,null,"2015-04-10"]
["Seghesio",2006,"Zinfandel","Zinfandel","Sonoma County",0.75,17.430174258351325,96,"2008-02-27","2008-02-27",24,"Vendor 65",0,0,1,1,96,null,"Cork (TBD)",0,null,"2015-04-03"]
["Ruffino",2007,"Sangiovese, cab s, merlot","Sangiovese Blend","Modus",0.75,23.387870762825013,96,"2012-01-07","2012-01-07",9,"Vendor 49",0,0,1,1,96,null,null,0,null,"2015-03-20"]
["Charles & Charles",2012,"Cabernet Sauvignon-Syrah","Cab S Blend","Cabernet Sauvignon-Syrah Columbia Valley Post No. 35",0.75,10.837875299513339,92,"2014-03-13","2014-03-18",12,"Vendor 43",0,0,1,1,92,null,null,0,null,"2015-03-08"]
["Pondview",2009,"Cabernet Sauvignon","Cab S","Cabernet Sauvignon Icewine",0.20000000298023224,36.371991723775864,92,"2011-11-17","2011-11-17",1,"Vendor 73",0,0,1,1,92,null,null,0,null,"2015-03-07"]
["Carlisle",2010,"Zinfandel","Zinfandel","Zinfandel, Russian River Valley, Martinelli Rd Vineyrd",0.75,47.48682629901171,92,"2012-07-18","2012-11-09",3,"Vendor 8",0,0,1,1,92,null,null,0,null,"2015-02-23"]
["La Badiola",2007,"Cab S, Merlot, Syrah","Cab S Blend","Maremma Toscana Acquagiusta",0.75,14.496451135754587,92,"2011-02-14","2011-02-16",12,"Vendor 60",0,0,1,1,92,null,null,0,null,"2015-02-21"]
["Proviva",2012,"Malbec","Malbec","Maipe Chakana Reserve Malbec",0.75,13.006433707505465,92,"2014-03-09","2014-03-09",12,"Vendor 30",0,0,1,1,92,null,null,0,null,"2015-01-31"]
["Carlisle",2012,"Mouvedre et al.","Mourvedre Blend","Two Acres, Russian River Vly, Red",0.75,48.394432194352149,92,"2014-07-07","2014-11-07",2,"Vendor 8",0,0,1,1,92,null,null,0,null,"2015-01-21"]
["Pierre Henri Morel",2011,"Grenache (50), Syrah (25), Mouvedre (25)","Grenache Blend","Cotes du Rhone Villages Signarques",0.75,15.194237592637538,91,"2014-02-18","2014-02-20",12,"Vendor 51",0,0,1,1,91,null,null,0,null,"2015-01-08"]
["Neyers",2006,"Syrah","Shiraz/Syrah Blend","Sonoma Coast Old Lakeville Road ",0.75,29.375770808458327,93,"2008-03-15","2008-03-15",12,"Vendor 51",0,0,1,1,93,null,"Cork (TBD)",0,null,"2014-12-11"]
["Terrabianca",2007,"Sangiovese & Cab S","Sangiovese Blend","Toscana Campaccio",0.75,22.071311686903236,93,"2011-09-18","2011-09-24",12,"Vendor 64",0,0,1,1,93,null,null,0,null,"2014-12-04"]
["Valdez",2007,"Zinfandel","Zinfandel","Dry Creek Valley Simoncini Vineyard",0.75,43.397619559586047,92,"2010-06-10","2010-06-16",12,"Vendor 35",0,0,1,1,92,null,"Cork (TBD)",0,null,"2014-11-02"]
["A to Z Wineworks",2011,"Pinot Noir","Pinot Noir","Pinot Noir Oregon",0.75,15.238604970902205,91,"2013-11-22","2013-11-26",12,"Vendor 64",0,0,1,1,91,null,"Screwtop",0,null,"2014-10-11"]
["Four Vines",2008,"Zinfandel","Zinfandel","Paso Robles Biker",0.75,23.469539364337923,91,"2010-11-15","2010-11-17",12,"Vendor 13",0,0,1,1,91,null,null,0,null,"2014-09-13"]
["Brancaia",2007,"Sangiovese, Merlot, Cab S","Sangiovese Blend","Toscana Tre",0.75,19.870239652067426,92,"2010-03-25","2010-03-26",12,"Vendor 43",0,0,1,1,92,null,"Cork (TBD)",0,null,"2014-08-18"]
["Quinta de Cabriz",2008,"Touriga Blend","Touriga Blend","Dao (Colheita Seleccionada Red)",0.75,8.4200855672359456,92,"2011-02-13","2011-02-15",24,"Vendor 54",0,0,1,1,92,null,null,0,null,"2014-07-13"]
["Proper Wines",2010,"Syrah","Shiraz/Syrah","Proper Syrah",0.75,29.746159143447876,92,"2013-02-10","2013-02-23",12,"Vendor 39",0,0,1,1,92,null,null,0,null,"2014-07-07"]
["Domaine la Roquete",2005,"Chateauneuf Du Pape","Grenache Blend","Chateauneuf du Pape",0.75,28.248019218444824,94,"2008-06-01","2008-06-01",2,"Vendor 53",0,0,1,1,94,null,"Cork (TBD)",0,null,"2014-06-29"]
["Chapoutier, M.",2008,"Grenache, Syrah & Carignan","Grenache Blend","Côtes du Roussillon-Villages Les Vignes de Bila-Haut",0.75,11.757073978275059,90,"2010-08-28","2010-08-28",12,"Vendor 13",0,0,1,1,90,null,"Cork (TBD)",0,null,"2014-06-15"]
["Viticcio",2007,"Sangiovese, Cab S, Merlot","Sangiovese Blend","Toscana Bere",0.75,13.023107975780965,90,"2010-01-26","2010-02-01",12,"Vendor 16",0,0,1,1,90,null,"Cork (TBD)",0,null,"2014-06-04"]
["Fattoria del Cerro",2009,"Sangiovese Blend","Sangiovese Blend","Chianti Colli Senese",0.75,9.7526985606551175,92,"2012-02-23","2012-02-24",24,"Vendor 30",0,0,1,1,92,null,null,0,null,"2014-06-04"]
["Shoofly",2010,"Shiraz","Shiraz/Syrah","Shiraz Adelaide",0.75,11.28034723508358,92,"2012-06-04","2012-06-06",24,"Vendor 13",0,0,1,1,92,null,"Screwtop",0,null,"2014-05-29"]
["Hijos de Antonio Barcelo",2004,"Tempranillo blend","Tempranillo Blend","Ribera del Duero Vina Mayor Reserva",0.75,18.378105742067099,92,"2010-06-23","2010-06-24",12,"Vendor 69",0,0,1,1,92,null,"Cork (TBD)",0,null,"2014-04-30"]
["Bodegas Lan",2006,"Rioja","Tempranillo Blend","Rioja Crianza",0.75,12.122607267916203,92,"2010-08-27","2010-09-01",12,"Vendor 13",0,0,1,1,92,null,"Cork (TBD)",0,null,"2014-04-17"]
["Perrin & Fils",2007,"Syrah blend","Shiraz/Syrah Blend","Cotes du Rhone Villages",0.75,11.959013771861791,92,"2011-06-15","2011-06-21",12,"Vendor 43",0,0,1,1,92,null,"Cork (TBD)",0,null,"2014-04-11"]
["Bodegas Resalte de Penafiel",2004,"Tempranillo","Tempranillo Blend","Ribera del Duero de Restia Crianza Selected Harvest",0.75,22.754130952358246,92,"2011-09-16","2011-09-22",12,"Vendor 65",0,0,1,1,92,null,null,0,null,"2014-04-05"]
["Yalumba",2005,"Grenache","Grenache","Barossa Bushvine",0.75,13.750212388694287,92,"2007-07-03","2007-07-03",12,"Vendor 61",0,0,1,1,92,null,"Cork (TBD)",0,null,"2014-03-15"]
["Domaine par Claude Branger",2010,"Muscadet","Muscadet","Muscadet de Sèvre et Maine Sur Lie Le Fils des Gras Moutons",0.75,15.19235726594925,92,"2012-05-01","2012-05-03",12,"Vendor 28",0,0,1,1,92,null,null,0,null,"2014-02-25"]
["Jacob's Creek",2010,"Chardonnay","Chardonnay","Adelaide Hills Reserve Chardonnay",0.75,11.541498979836703,92,"2012-06-03","2012-06-06",12,"Vendor 64",0,0,1,1,92,null,null,0,null,"2014-02-07"]
["Kosta Browne",2008,"Pinot Noir","Pinot Noir","Pinot Noir Russian River Valley",0.75,65.60480342710018,92,"2010-02-15","2010-04-01",3,"Vendor 22",0,0,1,1,92,null,"Cork (TBD)",0,null,"2014-01-19"]
["Airfield Estates",2010,"Sauvignon Blanc","Sauvignon Blanc","Sauvignon Blanc Yakima Valley",0.75,15.372787990480662,92,"2012-05-23","2012-05-25",12,"Vendor 71",0,0,1,1,92,null,"Screwtop",0,null,"2014-01-10"]
["Rotie Cellars",2010,"Syrah (75), Mouvedre (25)","Shiraz/Syrah Blend","Swordfight",0.75,66.501091688871384,92,"2013-03-25","2013-04-10",3,"Vendor 41",0,0,1,1,92,null,null,0,null,"2014-01-06"]
["Ken Forrester",2010,"Chenin Blanc","Chenin Blanc","Chenin Blanc Stellenbosch Reserve",0.75,12.612927942246198,92,"2012-04-30","2012-05-02",12,"Vendor 76",0,0,1,1,92,null,"Screwtop",0,null,"2014-01-04"]
["Eric Herault",2010,"Cab F","Cab F","Chinon Cuvee Tradition",0.75,16.489423873901366,92,"2013-01-10","2013-01-11",6,"Vendor 13",0,0,1,1,92,null,null,0,null,"2013-12-19"]
["Hijos de Antonio Barcelo",2003,"Tempranillo blend","Tempranillo Blend","Ribera del Duero Secreto Reserva",0.75,21.31572812756896,92,"2011-02-16","2011-02-18",12,"Vendor 52",0,0,1,1,92,null,null,0,null,"2013-11-29"]
["Pillar Box",2008,"Shiraz","Shiraz/Syrah","Reserve Shiraz",0.75,16.900255841851234,92,"2011-06-23","2011-06-27",12,"Vendor 59",0,0,1,1,92,null,null,0,null,"2013-10-27"]
["Vina Falernia",2007,"Syrah","Shiraz/Syrah","Syrah Elqui Valley Reserve",0.75,12.12738781172037,92,"2011-07-05","2011-07-12",24,"Vendor 15",0,0,1,1,92,null,null,0,null,"2013-10-14"]
["Quinta de Cabriz",2008,"Touriga Blend","Touriga Blend","Dao (Colheita Seleccionada Red)",0.75,7.4830230596065519,92,"2011-11-28","2011-11-29",12,"Vendor 25",0,0,1,1,92,null,null,0,null,"2013-09-04"]
["Carlisle",2011,"Grenache (78), Mouvedre (16), Syrah (6)","Grenache Blend","Three Birds, Sonoma County",0.75,31.694875244706868,92,"2013-01-17","2013-04-04",2,"Vendor 8",0,0,1,1,92,null,null,0,null,"2013-08-25"]
["Can Blau",2009,"Mazuelo 50, Syrah 25 and Garnacha 25","Mazuelo Blend","Blau",0.75,10.87298004090786,92,"2012-04-06","2012-04-18",12,"Vendor 62",0,0,1,1,92,null,null,0,null,"2013-08-14"]
["d'Arenberg",2008,"Shiraz","Shiraz/Syrah","Stump Jump Shiraz",0.75,9.9970487614274024,92,"2009-11-17","2009-11-19",24,"Vendor 25",0,0,1,1,92,null,"Screwtop",0,null,"2013-08-12"]
["Dierberg",2005,"Syrah","Shiraz/Syrah","Santa Ynez Valley",0.75,31.423067593574523,92,"2008-11-20","2008-11-20",6,"Vendor 68",0,0,1,1,92,null,"Cork (TBD)",0,null,"2013-07-28"]
["Torzi Matthews",2007,"Syrah","Shiraz/Syrah","Schist Rock Eden Valley",0.75,18.910527447581291,92,"2008-11-12","2008-11-12",12,"Vendor 7",0,0,1,1,92,null,"Screwtop",0,null,"2013-05-20"]
["Hijos de Antonio Barcelo",2004,"Tempranillo blend","Tempranillo Blend","Ribera del Duero Vina Mayor Reserva",0.75,20.74031237453222,92,"2010-05-13","2010-06-19",12,"Vendor 59",0,0,1,1,92,null,"Cork (TBD)",0,null,"2013-03-24"]
["Monte Antico",2006,"Sangiovese, Merlot, Cab S","Sangiovese Blend","Rosso",0.75,10.967661819040776,94,"2009-11-16","2009-11-18",24,"Vendor 59",0,0,1,1,94,null,"Screwtop",0,null,"2013-03-13"]
["Sheldrake Point",2008,"Riesling","Riesling","Late Harvest Riesling",0.75,23.43357852137089,91,"2011-08-16","2011-08-16",2,"Vendor 30",0,0,1,1,91,null,null,0,null,"2013-03-03"]
["Villa Pillo",2006,"Sangiovese, Cab S, Merlot","Sangiovese Blend","Toscana Borgoforte",0.75,14.088485421210528,91,"2008-11-12","2008-11-12",24,"Vendor 9",0,0,1,1,91,null,"Cork (Synthetic)",0,null,"2013-02-02"]
["Ravines",2009,"Riesling","Riesling","Riesling Finger Lakes Dry",0.75,15.650029420018196,91,"2011-07-09","2011-07-12",12,"Vendor 30",0,0,1,1,91,null,null,0,null,"2013-02-02"]
["Cattail Creek",2008,"Cab S","Cab S","Select Late Harvest Cab S",0.375,50.077376514673233,91,"2011-11-17","2011-11-17",1,"Vendor 73",0,{"$f":"M66*G66","v":0},1,1,{"$f":"H66*P66","v":91},null,null,0,null,"2013-02-02"]
["Bodegas Ondarre",2004,"Rioja","Tempranillo Blend","Rioja Reserva",0.75,13.189443765640259,91,"2010-10-21","2010-10-26",24,"Vendor 16",0,0,1,1,91,null,null,0,null,"2013-01-17"]
["Rocland",2009,"Shiraz","Shiraz/Syrah","Chocolate Box Dark Chocolate Shizaz",0.75,15.062448378413915,91,"2012-02-23","2012-02-24",12,"Vendor 30",0,0,1,1,91,null,"Screwtop",0,null,"2013-01-01"]
["Ruffino",2007,"Sangiovese Blend","Sangiovese Blend","Toscana Il Ducale",0.75,14.360310048758985,92,"2010-09-17","2010-09-22",12,"Vendor 13",0,0,1,1,92,null,null,0,null,"2012-12-20"]
["Georges Duboeuf",2009,"Gamay (Beaujolais)","Gamay","Morgon Jean Descombes",0.75,13.06187468740344,92,"2010-12-15","2010-12-17",12,"Vendor 13",0,0,1,1,92,null,null,0,null,"2012-12-05"]
["Carlisle",2010,"Syrah","Shiraz/Syrah","Syrah, Paso Robles, James Berry Vineyard",0.75,49.76755354642868,92,"2012-07-18","2012-11-09",1,"Vendor 8",0,0,1,1,92,null,null,0,null,"2012-11-25"]
["Carlisle",2010,"Zinfandel","Zinfandel","Zinfandel, Sonoma County, Bedrock Vineyard",0.75,42.595427786886695,92,"2012-07-18","2012-11-09",1,"Vendor 8",0,0,1,1,92,null,null,0,null,"2012-11-12"]
["Oyster Bay",2008,"Pinot Noir","Pinot Noir","Pinot Noir Marlborough",0.75,14.228254295885563,96,"2010-08-28","2010-08-28",12,"Vendor 13",0,0,1,1,96,null,"Screwtop",0,null,"2012-11-05"]
["Perrin & Fils",2007,"Syrah blend","Shiraz/Syrah Blend","Cotes du Rhone Villages",0.75,9.9723545931279656,96,"2009-12-24","2009-12-29",24,"Vendor 43",0,0,1,1,96,null,"Cork (TBD)",0,null,"2012-10-22"]
["Peter Lehmann",2008,"Shiraz, Mourvèdre, Grenache, Tempranillo and Carignane","Shiraz/Syrah Blend","Layers Red",0.75,12.156321061849594,92,"2011-07-18","2011-07-18",12,"Vendor 30",0,0,1,1,92,null,"Screwtop",0,null,"2012-10-02"]
["August Bonhomme",2009,"Chenin Blanc","Chenin Blanc","Vouvray Demi-Sec La Forcine",0.75,11.274957595467567,90,"2011-11-29","2011-12-01",12,"Vendor 57",0,0,1,1,90,null,null,0,null,"2012-09-13"]
["Roberto Anselmi",2010,"Garganega","Garganega","Veneto White San Vincenzo",0.75,13.207250336766243,90,"2012-04-05","2012-04-06",12,"Vendor 30",0,0,1,1,90,null,null,0,null,"2012-08-28"]
["Yalumba",2004,"Grenache","Grenache","Barossa Bushvine",0.75,14.391451384484768,90,"2007-04-17","2007-04-17",19,"Vendor 63",0,0,1,1,90,null,"Cork (TBD)",0,null,"2012-08-22"]
["Bodegas Borsao",2005,"Grenache (50), Tempranillo (25), Cab S (25)","Grenache Blend","Crianza Seleccion Campo de Borja",0.75,15.171837984323501,90,"2008-09-29","2008-09-29",12,"Vendor 59",0,0,1,1,90,null,"Cork (TBD)",0,null,"2012-08-22"]
["Rancourt",2008,"Cab S, Cab F","Cab F Blend","Cabernets Icewine",0.20000000298023224,52.319707721471786,93,"2011-11-17","2011-11-17",2,"Vendor 73",0,0,1,1,93,null,null,0,null,"2012-07-15"]
["Pondview",2009,"Cabernet Franc","Cab F","Cabernet Franc Icewine",0.20000000298023224,35.579279571771622,93,"2011-11-17","2011-11-17",1,"Vendor 73",0,0,1,1,93,null,null,0,null,"2012-07-07"]
["Perrin & Fils",2007,"Grenache, Syrah and Mourvèdre","Grenache Blend","Côtes du Rhône Réserve 2007",0.75,7.3543729327917102,93,"2011-06-18","2011-06-18",12,"Vendor 43",0,0,1,1,93,null,"Screwtop",0,null,"2012-06-21"]
["Seghesio",2007,"Zinfandel","Zinfandel","Sonoma County",0.75,21.988357014656067,93,"2008-10-04","2008-10-04",12,"Vendor 26",0,0,1,1,93,null,"Cork (TBD)",0,null,"2012-06-09"]
["Bodegas Ateca",2007,"Grenache","Grenache","Garnacha de Fuego Old Vines",0.75,7.1188583180308349,91,"2009-02-18","2009-02-18",24,"Vendor 36",0,0,1,1,91,null,"Cork (Synthetic)",0,null,"2012-05-26"]
["Domaine de Dionysos",2009,"Grenache, Syrah, Carignan and Cinsault","Grenache Blend","Côtes du Rhône La Devèze",0.75,12.11335677140951,91,"2011-06-16","2011-06-21",12,"Vendor 43",0,0,1,1,91,null,null,0,null,"2012-03-28"]
["Clos la Coutale",2007,"Malbec, Tannat?, Merlot?","Malbec Blend","Cahors",0.75,13.886280114203691,91,"2010-03-13","2010-03-16",12,"Vendor 64",0,0,1,1,91,null,"Cork (TBD)",0,null,"2012-03-25"]
["Alta Vista",2006,"Malbec","Malbec","Grande Reserve Terroir Selection",0.75,14.975337052941322,91,"2009-03-13","2009-03-17",12,"Vendor 70",0,0,1,1,91,null,"Cork (TBD)",0,null,"2012-03-22"]
["Jacob's Creek",2003,"Shiraz","Shiraz/Syrah","Centenary Hill",0.75,28.759275379508733,91,"2008-09-04","2008-09-04",6,"Vendor 15",0,0,1,1,91,null,"Cork (TBD)",0,null,"2012-03-20"]
["Jacob's Creek",2004,"Shiraz","Shiraz/Syrah","South Australia Reserve",0.75,11.103982855975627,91,"2007-12-07","2007-12-07",12,"Vendor 13",0,0,1,1,91,null,"Cork (TBD)",0,null,"2012-02-27"]
["Columbia Crest",2007,"Merlot, Cab S, Cab F, Syrah","Merlot Blend","Merlot Horse Heaven Hills H3",0.75,14.15184371444583,91,"2010-03-13","2010-03-16",12,"Vendor 15",0,0,1,1,91,null,"Cork (TBD)",0,null,"2012-02-04"]
["Langmeil",2004,"Shiraz/Grenache/Mourvedre","Shiraz/Syrah Blend","Three Gardens",0.75,17.791783987522127,91,"2007-04-03","2007-04-03",12,"Vendor 55",0,0,1,1,91,null,"Screwtop",0,null,"2012-01-31"]
["Fetish",2005,"Shiraz","Shiraz/Syrah","The Watcher Barossa Valley",0.75,15.615983425825835,91,"2007-11-28","2007-11-28",12,"Vendor 64",0,0,1,1,91,null,"Screwtop",0,null,"2012-01-25"]
["Fetish",2006,"Shiraz, Mataro, Grenache","Shiraz/Syrah Blend","Playmates",0.75,18.399662288427351,91,"2008-09-17","2008-09-17",12,"Vendor 65",0,0,1,1,91,null,"Screwtop",0,null,"2011-12-23"]
["Columbia Crest",2005,"Syrah, Sangiovese, Cab Sauvignon, Grenache,..","Shiraz/Syrah Blend","Two Vines 10 Red",0.75,9.4156884969770918,91,"2009-04-11","2009-04-24",12,"Vendor 7",0,0,1,1,91,null,"Cork (TBD)",0,null,"2011-12-12"]
["Strewn",2008,"Cabernet Franc","Cab F","Cabernet Franc Icewine",0.375,50.326051115989685,91,"2011-11-17","2011-11-17",1,"Vendor 73",0,0,1,1,91,null,null,0,null,"2011-12-07"]
["Northern Ice",2006,"Vidal","Vidal","Vidal Icewine",0.20000000298023224,35.050550118088722,91,"2011-11-17","2011-11-17",1,"Vendor 73",0,0,1,1,91,null,null,0,null,"2011-11-24"]
["Hinterbrook",2009,"Vidal","Vidal","Vidal Icewine",0.375,50.86347907781601,91,"2011-11-17","2011-11-17",1,"Vendor 73",0,0,1,1,91,null,null,0,null,"2011-11-24"]
["Bodegas Lan",2006,"Rioja","Tempranillo Blend","Rioja Crianza",0.75,12.318327275723219,91,"2010-08-16","2010-08-17",12,"Vendor 13",0,0,1,1,91,null,null,0,null,"2011-11-07"]
["Peter Lehmann",2005,"Shiraz","Shiraz/Syrah","Shiraz Barossa",0.75,15.692215919494629,91,"2008-07-16","2008-07-16",12,"Vendor 65",0,0,1,1,91,null,"Cork (TBD)",0,null,"2011-10-21"]
["Desert Wind",2005,"Merlot/Cabernet","Merlot Blend","Ruah",0.75,15.619336336702109,93,"2009-05-12","2009-05-15",12,"Vendor 5",0,0,1,1,93,null,"Cork (TBD)",0,null,"2011-10-10"]
["Four Vines",2005,"Zinfandel","Zinfandel","Amador County",0.75,18.386185594677926,93,"2007-06-29","2007-06-29",12,"Vendor 26",0,0,1,1,93,null,"Cork (TBD)",0,null,"2011-09-23"]
["Yealands",2008,"Pinot Noir","Pinot Noir","Pinot Noir Marlborough",0.75,15.802212099909783,93,"2010-02-22","2010-02-26",12,"Vendor 7",0,0,1,1,93,null,"Screwtop",0,null,"2011-09-16"]
["Zaca Mesa",2006,"Syrah","Shiraz/Syrah","Syrah Santa Ynez Valley",0.75,18.670711177945137,93,"2010-04-29","2010-04-30",12,"Vendor 13",0,0,1,1,93,null,"Cork (TBD)",0,null,"2011-09-13"]
["Bodegas Borsao",2008,"Garnacha","Grenache","Campo de Borja",0.75,8.7134282311499121,91,"2010-02-17","2010-02-19",12,"Vendor 25",0,0,1,1,91,null,"Cork (TBD)",0,null,"2011-08-24"]
["Kim Crawford",2008,"Sauvignon Blanc","Sauvignon Blanc","Sauvignon Blanc Marlborough",0.75,15.645030799508094,91,"2009-05-21","2009-05-22",12,"Vendor 13",0,0,1,1,91,null,"Screwtop",0,null,"2011-07-09"]
["d'Arenberg",2008,"Shiraz","Shiraz/Syrah","Stump Jump Shiraz",0.75,10.561376011788846,91,"2009-11-16","2009-11-17",24,"Vendor 57",0,0,1,1,91,null,"Screwtop",0,null,"2011-07-05"]
["Orin Swift",2005,"Zinfandel, Cabernet Sauvignon, Syrah, Petite Sirah and Charbono","Zinfandel Blend","The Prisoner",0.75,28.618107154369355,91,"2007-05-08","2007-05-08",12,"Vendor 64",0,0,1,1,91,null,"Cork (TBD)",0,null,"2011-07-01"]
["Navarro",2004,"Zinfandel","Zinfandel","Mendocino",0.75,21.642943136215212,91,"2007-04-11","2007-04-11",12,"Vendor 32",0,0,1,1,91,null,"Cork (TBD)",0,null,"2011-06-11"]
["Rolf Binder",2004,"Shiraz, Grenache, Mouvedre","Shiraz/Syrah Blend","Heinrich Barossa",0.75,14.370729331970216,91,"2008-06-30","2008-06-30",12,"Vendor 20",0,0,1,1,91,null,"Cork (TBD)",0,null,"2011-05-25"]
["Monte Antico",2006,"Sangiovese, Merlot, Cab S","Sangiovese Blend","Rosso",0.75,12.013611086994409,91,"2010-02-17","2010-02-19",12,"Vendor 25",0,0,1,1,91,null,"Screwtop",0,null,"2011-05-10"]
["Four Vines",2004,"Zinfandel","Zinfandel","Amador County",0.75,20.68356654047966,91,"2007-04-07","2007-04-07",6,"Vendor 37",0,0,1,1,91,null,"Cork (TBD)",0,null,"2011-05-03"]
["Fairview",2005,"Shiraz","Shiraz/Syrah","Coastal Region",0.75,12.090367609977722,91,"2008-09-16","2008-09-16",12,"Vendor 13",0,0,1,1,91,null,"Screwtop",0,null,"2011-03-11"]
["Bodegas Borsao",2005,"Grenache (50), Tempranillo (25), Cab S (25)","Grenache Blend","Crianza Seleccion Campo de Borja",0.75,15.499827053010463,91,"2008-09-27","2008-09-27",12,"Vendor 64",0,0,1,1,91,null,"Cork (TBD)",0,null,"2011-02-19"]
["Killibinbin",2004,"Shiraz/Cabernet Sauvignon","Shiraz/Syrah Blend","Langhorne Creek",0.75,13.997861504107712,91,"2007-03-23","2007-03-23",24,"Vendor 43",0,0,1,1,91,null,"Screwtop",0,null,"2011-02-09"]
["La Posta del Vinatero",2007,"Malbec","Malbec","Uco Valley Pizella Family Vineyard",0.75,16.237592186450957,91,"2009-05-12","2009-05-27",12,"Vendor 59",0,0,1,1,91,null,"Cork (TBD)",0,null,"2011-01-08"]
["Hogue",2006,"Cabernet Sauvignon","Cab S","Columbia Valley",0.75,8.5591364646554009,91,"2008-06-06","2008-06-06",24,"Vendor 6",0,0,1,1,91,null,"Cork (TBD)",0,null,"2011-01-02"]
["Santa Ema",2005,"Cabernet Sauvignon","Cab S","Cabernet Sauvignon Maipo Valley Reserve",0.75,9.9161344415545472,91,"2009-04-07","2009-04-09",12,"Vendor 69",0,0,1,1,91,null,"Cork (TBD)",0,null,"2011-01-02"]
["Peter Lehmann",2004,"Shiraz, Cabernet Sauvignon, Merlot","Shiraz/Syrah Blend","Clancy's Red Barossa",0.75,15.625961281210184,91,"2007-03-23","2007-03-27",12,"Vendor 4",0,0,1,1,91,null,"Cork (TBD)",0,null,"2011-01-02"]
["Thorn Clarke",2005,"Cabernet Sauvignon, Malbec, P Verdot, Cab Franc, Merlot","Cab S Blend","Barossa Cuvee",0.75,16.361325355410575,91,"2007-06-17","2007-06-17",12,"Vendor 43",1,16.361325355410575,1,1,91,null,"Cork (TBD)",0,null,"2011-01-01"]
["Quinta de Cabriz",2006,"Touriga Blend","Touriga Blend","Dao",0.75,8.4110753932893285,91,"2009-06-11","2009-06-18",12,"Vendor 65",0,0,1,1,91,null,"Cork (TBD)",0,null,"2010-12-31"]
["Boekenhoutskloof",2007,"Syrah, Mouvedre, Viognier","Shiraz/Syrah Blend","Wolftrap Western Cape",0.75,9.3373899555802335,91,"2009-03-30","2009-04-03",12,"Vendor 7",0,{"$f":"M121*G121","v":0},1,1,{"$f":"H121*P121","v":91},null,"Screwtop",0,null,"2010-12-17"]