{"text_format":"1","workbook":"xlsx","n_sheets":10,"sheets":["Disclaimer","Instructions","Parameters","Overall","Sub Analysis A","Sub Analysis B","Sub Analysis C","Sub Analysis D","Sub Analysis E","Summary"],"not_rendered":{"charts":0,"images":3,"macros":1,"external_links":0,"defined_names":1,"comments":0,"pivot_tables":0},"unopened":[],"bounds":{"document_bytes":16777216,"sheet_cells":100000,"rows_first":2000,"rows_last":500,"rows_between":2000,"halvings":0,"cell_chars":16384,"cell_head_chars":4096},"cells_cut":0,"cells_raw":0,"read":"whole","date_system":"1900"}

{"sheet":"Disclaimer","index":0,"n_rows":98,"n_cols":1,"rows_kept":98,"cut":false,"hidden":false,"merged":[]}
["CHR TOOLS EVALUATION LICENSE"]
[]
["IMPORTANT --- READ CAREFULLY. This evaluation license agreement (\"Agreement\") is a legal contract between you (either an individual or a single business entity) and The Center for Hospitality Research at Cornell University (\"Licensor\") for the software product identified above, which includes computer software and, as applicable, associated media, printed materials, and \"online\" or electronic documentation (the \"Software Application\")."]
[]
["BY INSTALLING, COPYING, OR OTHERWISE USING THE SOFTWARE APPLICATION, YOU AGREE TO BE BOUND BY THE TERMS OF THIS AGREEMENT. IF YOU DO NOT AGREE TO THE TERMS OF THIS AGREEMENT, DO NOT INSTALL OR USE THE SOFTWARE APPLICATION."]
[]
["License Terms"]
[]
["Following acceptance of this Agreement and on-line registration with the Licensor, you may use, strictly for trial use and evaluation purposes only, one copy of the Software Application."]
[]
{"$rows_left_out":89}
{"sheet":"Instructions","index":1,"n_rows":16,"n_cols":1,"rows_kept":16,"cut":false,"hidden":false,"merged":[[0,0,0,5],[1,0,1,5],[3,0,3,5]]}
["Hotel Competitor Analysis Tool (HCAT)"]
["Copyright © 2011, Cathy A. Enz & Gary M. Thompson"]
[]
["CAUTION:  When using this tool, please do not rename any worksheets, or insert rows or columns, as doing so will likely result in the tool not working."]
[]
["Steps: "]
["1.  Click on the Parameters tab."]
["2.  Identify the types of analyses you wish to conduct, include an overall analysis and up to five additional sub-groups (see figure to the right)."]
["3.  List up to ten competitors for each of the six analyses (see figure to the right).  "]
["4.  Click the gray button “Click to Proceed, after specifying information above”. "]
{"$rows_left_out":7}
{"sheet":"Parameters","index":2,"n_rows":8,"n_cols":12,"rows_kept":8,"cut":false,"hidden":false,"merged":[[0,2,0,11]]}
["Your Property:","Your Property's Name","Name of Competitor"]
[null,"Name of Analysis",1,2,3,4,5,6,7,8,9,10]
["Analysis 1","Overall","Competitor 1","Competitor 2","Competitor 3","Competitor 4","Competitor 5","Competitor 6","Competitor 7","Competitor 8","Competitor 9","Competitor 10"]
["Analysis 2","Sub Analysis A","Competitor 1","Competitor 2","Competitor 3","Competitor 4","Competitor 5","Competitor 6","Competitor 7","Competitor 8","Competitor 9","Competitor 10"]
["Analysis 3","Sub Analysis B","Competitor 1","Competitor 2","Competitor 3","Competitor 4","Competitor 5","Competitor 6","Competitor 7","Competitor 8","Competitor 9","Competitor 10"]
["Analysis 4","Sub Analysis C","Competitor 1","Competitor 2","Competitor 3","Competitor 4","Competitor 5","Competitor 6","Competitor 7","Competitor 8","Competitor 9","Competitor 10"]
["Analysis 5","Sub Analysis D","Competitor 1","Competitor 2","Competitor 3","Competitor 4","Competitor 5","Competitor 6","Competitor 7","Competitor 8","Competitor 9","Competitor 10"]
["Analysis 6","Sub Analysis E","Competitor 1","Competitor 2","Competitor 3","Competitor 4","Competitor 5","Competitor 6","Competitor 7","Competitor 8","Competitor 9","Competitor 10"]

{"sheet":"Overall","index":3,"n_rows":19,"n_cols":29,"rows_kept":19,"cut":false,"hidden":false,"merged":[[2,3,11,3],[2,15,11,15],[12,4,12,15],[14,1,14,2],[14,4,14,15],[15,4,15,15],[0,22,1,22],[0,23,1,23],[0,24,1,24],[0,25,1,25],[0,9,1,9],[0,10,1,10],[0,11,1,11],[0,12,1,12],[0,13,1,13],[0,14,1,14],[0,8,1,8],[13,4,13,15],[0,26,1,26],[0,27,1,27],[0,15,1,15],[0,17,1,17],[0,18,1,18],[0,19,1,19],[0,20,1,20],[0,21,1,21],[0,0,0,2],[0,4,1,4],[0,5,1,5],[0,6,1,6],[0,7,1,7]]}
["Critical Success Factors",null,null,null,"Your Property's Name","Competitor 1","Competitor 2","Competitor 3","Competitor 4","Competitor 5","Competitor 6","Competitor 7","Competitor 8","Competitor 9","Competitor 10",null,"Competitor 6","Your Property's Name","Competitor 1","Competitor 2","Competitor 3","Competitor 4","Competitor 5","Competitor 6","Competitor 7","Competitor 8","Competitor 9","Competitor 10",10]
["#","Factor","Weight",null,null,null,null,null,null,null,null,null,null,null,null,null,null,null,null,null,null,null,null,null,null,null,null,null,{"$f":"LARGE(R13:AB13,1)","v":0}]
[1,null,null,"Scores:",null,null,null,null,null,null,null,null,null,null,null,"Wt * Rtng:",null,{"$f":"IF($C3>0,$C3*E3,\"\")","v":""},"","","","","","","","","","",{"$f":"LARGE(R13:AB13,2)","v":0}]
[2,null,null,null,null,null,null,null,null,null,null,null,null,null,null,null,null,{"$f":"IF($C4>0,$C4*E4,\"\")","v":""},{"$f":"IF($C4>0,$C4*F4,\"\")","v":""},{"$f":"IF($C4>0,$C4*G4,\"\")","v":""},{"$f":"IF($C4>0,$C4*H4,\"\")","v":""},{"$f":"IF($C4>0,$C4*I4,\"\")","v":""},{"$f":"IF($C4>0,$C4*J4,\"\")","v":""},{"$f":"IF($C4>0,$C4*K4,\"\")","v":""},{"$f":"IF($C4>0,$C4*L4,\"\")","v":""},{"$f":"IF($C4>0,$C4*M4,\"\")","v":""},{"$f":"IF($C4>0,$C4*N4,\"\")","v":""},{"$f":"IF($C4>0,$C4*O4,\"\")","v":""},{"$f":"LARGE(R13:AB13,3)","v":0}]
[3,null,null,null,null,null,null,null,null,null,null,null,null,null,null,null,null,"","","","","","","","","","","",{"$f":"LARGE(R13:AB13,4)","v":0}]
[4,null,null,null,null,null,null,null,null,null,null,null,null,null,null,null,null,"","","","","","","","","","","",{"$f":"LARGE(R13:AB13,5)","v":0}]
[5,null,null,null,null,null,null,null,null,null,null,null,null,null,null,null,null,"","","","","","","","","","","",{"$f":"LARGE(R13:AB13,6)","v":0}]
[6,null,null,null,null,null,null,null,null,null,null,null,null,null,null,null,null,"","","","","","","","","","","",{"$f":"LARGE(R13:AB13,7)","v":0}]
[7,null,null,null,null,null,null,null,null,null,null,null,null,null,null,null,null,"","","","","","","","","","","",{"$f":"LARGE(R13:AB13,8)","v":0}]
[8,null,null,null,null,null,null,null,null,null,null,null,null,null,null,null,null,"","","","","","","","","","","",{"$f":"LARGE(R13:AB13,9)","v":0}]
{"$rows_left_out":10}
{"sheet":"Sub Analysis A","index":4,"n_rows":19,"n_cols":29,"rows_kept":19,"cut":false,"hidden":false,"merged":[[0,24,1,24],[0,25,1,25],[0,26,1,26],[0,27,1,27],[14,1,14,2],[0,19,1,19],[0,20,1,20],[0,21,1,21],[0,22,1,22],[0,23,1,23],[0,13,1,13],[0,14,1,14],[0,15,1,15],[0,17,1,17],[0,18,1,18],[0,8,1,8],[0,9,1,9],[0,10,1,10],[0,11,1,11],[0,12,1,12],[0,0,0,2],[0,4,1,4],[0,5,1,5],[0,6,1,6],[0,7,1,7],[12,4,12,15],[14,4,14,15],[15,4,15,15],[2,3,11,3],[2,15,11,15],[13,4,13,15]]}
["Critical Success Factors",null,null,null,"Your Property's Name","Competitor 1","Competitor 2","Competitor 3","Competitor 4","Competitor 5","Competitor 6","Competitor 7","Competitor 8","Competitor 9","Competitor 10",null,"Competitor 6","Your Property's Name","Competitor 1","Competitor 2","Competitor 3","Competitor 4","Competitor 5","Competitor 6","Competitor 7","Competitor 8","Competitor 9","Competitor 10",10]
["#","Factor","Weight",null,null,null,null,null,null,null,null,null,null,null,null,null,null,null,null,null,null,null,null,null,null,null,null,null,{"$f":"LARGE(R13:AB13,1)","v":0}]
[1,null,null,"Scores:",null,null,null,null,null,null,null,null,null,null,null,"Wt * Rtng:",null,{"$f":"IF($C3>0,$C3*E3,\"\")","v":""},"","","","","","","","","","",{"$f":"LARGE(R13:AB13,2)","v":0}]
[2,null,null,null,null,null,null,null,null,null,null,null,null,null,null,null,null,{"$f":"IF($C4>0,$C4*E4,\"\")","v":""},{"$f":"IF($C4>0,$C4*F4,\"\")","v":""},{"$f":"IF($C4>0,$C4*G4,\"\")","v":""},{"$f":"IF($C4>0,$C4*H4,\"\")","v":""},{"$f":"IF($C4>0,$C4*I4,\"\")","v":""},{"$f":"IF($C4>0,$C4*J4,\"\")","v":""},{"$f":"IF($C4>0,$C4*K4,\"\")","v":""},{"$f":"IF($C4>0,$C4*L4,\"\")","v":""},{"$f":"IF($C4>0,$C4*M4,\"\")","v":""},{"$f":"IF($C4>0,$C4*N4,\"\")","v":""},{"$f":"IF($C4>0,$C4*O4,\"\")","v":""},{"$f":"LARGE(R13:AB13,3)","v":0}]
[3,null,null,null,null,null,null,null,null,null,null,null,null,null,null,null,null,"","","","","","","","","","","",{"$f":"LARGE(R13:AB13,4)","v":0}]
[4,null,null,null,null,null,null,null,null,null,null,null,null,null,null,null,null,"","","","","","","","","","","",{"$f":"LARGE(R13:AB13,5)","v":0}]
[5,null,null,null,null,null,null,null,null,null,null,null,null,null,null,null,null,"","","","","","","","","","","",{"$f":"LARGE(R13:AB13,6)","v":0}]
[6,null,null,null,null,null,null,null,null,null,null,null,null,null,null,null,null,"","","","","","","","","","","",{"$f":"LARGE(R13:AB13,7)","v":0}]
[7,null,null,null,null,null,null,null,null,null,null,null,null,null,null,null,null,"","","","","","","","","","","",{"$f":"LARGE(R13:AB13,8)","v":0}]
[8,null,null,null,null,null,null,null,null,null,null,null,null,null,null,null,null,"","","","","","","","","","","",{"$f":"LARGE(R13:AB13,9)","v":0}]
{"$rows_left_out":10}
{"sheet":"Sub Analysis B","index":5,"n_rows":20,"n_cols":29,"rows_kept":20,"cut":false,"hidden":false,"merged":[[0,24,1,24],[0,25,1,25],[0,26,1,26],[0,27,1,27],[14,1,14,2],[0,19,1,19],[0,20,1,20],[0,21,1,21],[0,22,1,22],[0,23,1,23],[0,13,1,13],[0,14,1,14],[0,15,1,15],[0,17,1,17],[0,18,1,18],[0,8,1,8],[0,9,1,9],[0,10,1,10],[0,11,1,11],[0,12,1,12],[0,0,0,2],[0,4,1,4],[0,5,1,5],[0,6,1,6],[0,7,1,7],[12,4,12,15],[13,4,13,15],[15,4,15,15],[2,3,11,3],[2,15,11,15],[14,4,14,15]]}
["Critical Success Factors",null,null,null,"Your Property's Name","Competitor 1","Competitor 2","Competitor 3","Competitor 4","Competitor 5","Competitor 6","Competitor 7","Competitor 8","Competitor 9","Competitor 10",null,"Competitor 6","Your Property's Name","Competitor 1","Competitor 2","Competitor 3","Competitor 4","Competitor 5","Competitor 6","Competitor 7","Competitor 8","Competitor 9","Competitor 10",10]
["#","Factor","Weight",null,null,null,null,null,null,null,null,null,null,null,null,null,null,null,null,null,null,null,null,null,null,null,null,null,{"$f":"LARGE(R13:AB13,1)","v":0}]
[1,null,null,"Scores:",null,null,null,null,null,null,null,null,null,null,null,"Wt * Rtng:",null,{"$f":"IF($C3>0,$C3*E3,\"\")","v":""},"","","","","","","","","","",{"$f":"LARGE(R13:AB13,2)","v":0}]
[2,null,null,null,null,null,null,null,null,null,null,null,null,null,null,null,null,{"$f":"IF($C4>0,$C4*E4,\"\")","v":""},{"$f":"IF($C4>0,$C4*F4,\"\")","v":""},{"$f":"IF($C4>0,$C4*G4,\"\")","v":""},{"$f":"IF($C4>0,$C4*H4,\"\")","v":""},{"$f":"IF($C4>0,$C4*I4,\"\")","v":""},{"$f":"IF($C4>0,$C4*J4,\"\")","v":""},{"$f":"IF($C4>0,$C4*K4,\"\")","v":""},{"$f":"IF($C4>0,$C4*L4,\"\")","v":""},{"$f":"IF($C4>0,$C4*M4,\"\")","v":""},{"$f":"IF($C4>0,$C4*N4,\"\")","v":""},{"$f":"IF($C4>0,$C4*O4,\"\")","v":""},{"$f":"LARGE(R13:AB13,3)","v":0}]
[3,null,null,null,null,null,null,null,null,null,null,null,null,null,null,null,null,"","","","","","","","","","","",{"$f":"LARGE(R13:AB13,4)","v":0}]
[4,null,null,null,null,null,null,null,null,null,null,null,null,null,null,null,null,"","","","","","","","","","","",{"$f":"LARGE(R13:AB13,5)","v":0}]
[5,null,null,null,null,null,null,null,null,null,null,null,null,null,null,null,null,"","","","","","","","","","","",{"$f":"LARGE(R13:AB13,6)","v":0}]
[6,null,null,null,null,null,null,null,null,null,null,null,null,null,null,null,null,"","","","","","","","","","","",{"$f":"LARGE(R13:AB13,7)","v":0}]
[7,null,null,null,null,null,null,null,null,null,null,null,null,null,null,null,null,"","","","","","","","","","","",{"$f":"LARGE(R13:AB13,8)","v":0}]
[8,null,null,null,null,null,null,null,null,null,null,null,null,null,null,null,null,"","","","","","","","","","","",{"$f":"LARGE(R13:AB13,9)","v":0}]
{"$rows_left_out":11}
{"sheet":"Sub Analysis C","index":6,"n_rows":19,"n_cols":29,"rows_kept":19,"cut":false,"hidden":false,"merged":[[2,3,11,3],[2,15,11,15],[12,4,12,15],[14,1,14,2],[14,4,14,15],[15,4,15,15],[0,22,1,22],[0,23,1,23],[0,24,1,24],[0,25,1,25],[0,9,1,9],[0,10,1,10],[0,11,1,11],[0,12,1,12],[0,13,1,13],[0,14,1,14],[0,8,1,8],[13,4,13,15],[0,26,1,26],[0,27,1,27],[0,15,1,15],[0,17,1,17],[0,18,1,18],[0,19,1,19],[0,20,1,20],[0,21,1,21],[0,0,0,2],[0,4,1,4],[0,5,1,5],[0,6,1,6],[0,7,1,7]]}
["Critical Success Factors",null,null,null,"Your Property's Name","Competitor 1","Competitor 2","Competitor 3","Competitor 4","Competitor 5","Competitor 6","Competitor 7","Competitor 8","Competitor 9","Competitor 10",null,"Competitor 6","Your Property's Name","Competitor 1","Competitor 2","Competitor 3","Competitor 4","Competitor 5","Competitor 6","Competitor 7","Competitor 8","Competitor 9","Competitor 10",10]
["#","Factor","Weight",null,null,null,null,null,null,null,null,null,null,null,null,null,null,null,null,null,null,null,null,null,null,null,null,null,{"$f":"LARGE(R13:AB13,1)","v":0}]
[1,null,null,"Scores:",null,null,null,null,null,null,null,null,null,null,null,"Wt * Rtng:",null,{"$f":"IF($C3>0,$C3*E3,\"\")","v":""},"","","","","","","","","","",{"$f":"LARGE(R13:AB13,2)","v":0}]
[2,null,null,null,null,null,null,null,null,null,null,null,null,null,null,null,null,{"$f":"IF($C4>0,$C4*E4,\"\")","v":""},{"$f":"IF($C4>0,$C4*F4,\"\")","v":""},{"$f":"IF($C4>0,$C4*G4,\"\")","v":""},{"$f":"IF($C4>0,$C4*H4,\"\")","v":""},{"$f":"IF($C4>0,$C4*I4,\"\")","v":""},{"$f":"IF($C4>0,$C4*J4,\"\")","v":""},{"$f":"IF($C4>0,$C4*K4,\"\")","v":""},{"$f":"IF($C4>0,$C4*L4,\"\")","v":""},{"$f":"IF($C4>0,$C4*M4,\"\")","v":""},{"$f":"IF($C4>0,$C4*N4,\"\")","v":""},{"$f":"IF($C4>0,$C4*O4,\"\")","v":""},{"$f":"LARGE(R13:AB13,3)","v":0}]
[3,null,null,null,null,null,null,null,null,null,null,null,null,null,null,null,null,"","","","","","","","","","","",{"$f":"LARGE(R13:AB13,4)","v":0}]
[4,null,null,null,null,null,null,null,null,null,null,null,null,null,null,null,null,"","","","","","","","","","","",{"$f":"LARGE(R13:AB13,5)","v":0}]
[5,null,null,null,null,null,null,null,null,null,null,null,null,null,null,null,null,"","","","","","","","","","","",{"$f":"LARGE(R13:AB13,6)","v":0}]
[6,null,null,null,null,null,null,null,null,null,null,null,null,null,null,null,null,"","","","","","","","","","","",{"$f":"LARGE(R13:AB13,7)","v":0}]
[7,null,null,null,null,null,null,null,null,null,null,null,null,null,null,null,null,"","","","","","","","","","","",{"$f":"LARGE(R13:AB13,8)","v":0}]
[8,null,null,null,null,null,null,null,null,null,null,null,null,null,null,null,null,"","","","","","","","","","","",{"$f":"LARGE(R13:AB13,9)","v":0}]
{"$rows_left_out":10}
{"sheet":"Sub Analysis D","index":7,"n_rows":19,"n_cols":29,"rows_kept":19,"cut":false,"hidden":false,"merged":[[0,24,1,24],[0,25,1,25],[0,26,1,26],[0,27,1,27],[14,1,14,2],[0,19,1,19],[0,20,1,20],[0,21,1,21],[0,22,1,22],[0,23,1,23],[0,13,1,13],[0,14,1,14],[0,15,1,15],[0,17,1,17],[0,18,1,18],[0,8,1,8],[0,9,1,9],[0,10,1,10],[0,11,1,11],[0,12,1,12],[0,0,0,2],[0,4,1,4],[0,5,1,5],[0,6,1,6],[0,7,1,7],[12,4,12,15],[14,4,14,15],[15,4,15,15],[2,3,11,3],[2,15,11,15],[13,4,13,15]]}
["Critical Success Factors",null,null,null,"Your Property's Name","Competitor 1","Competitor 2","Competitor 3","Competitor 4","Competitor 5","Competitor 6","Competitor 7","Competitor 8","Competitor 9","Competitor 10",null,"Competitor 6","Your Property's Name","Competitor 1","Competitor 2","Competitor 3","Competitor 4","Competitor 5","Competitor 6","Competitor 7","Competitor 8","Competitor 9","Competitor 10",10]
["#","Factor","Weight",null,null,null,null,null,null,null,null,null,null,null,null,null,null,null,null,null,null,null,null,null,null,null,null,null,{"$f":"LARGE(R13:AB13,1)","v":0}]
[1,null,null,"Scores:",null,null,null,null,null,null,null,null,null,null,null,"Wt * Rtng:",null,{"$f":"IF($C3>0,$C3*E3,\"\")","v":""},"","","","","","","","","","",{"$f":"LARGE(R13:AB13,2)","v":0}]
[2,null,null,null,null,null,null,null,null,null,null,null,null,null,null,null,null,{"$f":"IF($C4>0,$C4*E4,\"\")","v":""},{"$f":"IF($C4>0,$C4*F4,\"\")","v":""},{"$f":"IF($C4>0,$C4*G4,\"\")","v":""},{"$f":"IF($C4>0,$C4*H4,\"\")","v":""},{"$f":"IF($C4>0,$C4*I4,\"\")","v":""},{"$f":"IF($C4>0,$C4*J4,\"\")","v":""},{"$f":"IF($C4>0,$C4*K4,\"\")","v":""},{"$f":"IF($C4>0,$C4*L4,\"\")","v":""},{"$f":"IF($C4>0,$C4*M4,\"\")","v":""},{"$f":"IF($C4>0,$C4*N4,\"\")","v":""},{"$f":"IF($C4>0,$C4*O4,\"\")","v":""},{"$f":"LARGE(R13:AB13,3)","v":0}]
[3,null,null,null,null,null,null,null,null,null,null,null,null,null,null,null,null,"","","","","","","","","","","",{"$f":"LARGE(R13:AB13,4)","v":0}]
[4,null,null,null,null,null,null,null,null,null,null,null,null,null,null,null,null,"","","","","","","","","","","",{"$f":"LARGE(R13:AB13,5)","v":0}]
[5,null,null,null,null,null,null,null,null,null,null,null,null,null,null,null,null,"","","","","","","","","","","",{"$f":"LARGE(R13:AB13,6)","v":0}]
[6,null,null,null,null,null,null,null,null,null,null,null,null,null,null,null,null,"","","","","","","","","","","",{"$f":"LARGE(R13:AB13,7)","v":0}]
[7,null,null,null,null,null,null,null,null,null,null,null,null,null,null,null,null,"","","","","","","","","","","",{"$f":"LARGE(R13:AB13,8)","v":0}]
[8,null,null,null,null,null,null,null,null,null,null,null,null,null,null,null,null,"","","","","","","","","","","",{"$f":"LARGE(R13:AB13,9)","v":0}]
{"$rows_left_out":10}
{"sheet":"Sub Analysis E","index":8,"n_rows":19,"n_cols":65,"rows_kept":19,"cut":false,"hidden":false,"merged":[[0,0,0,2],[14,1,14,2],[2,3,11,3],[0,9,1,9],[0,10,1,10],[0,4,1,4],[0,5,1,5],[0,6,1,6],[0,7,1,7],[0,8,1,8],[12,4,12,15],[14,4,14,15],[0,12,1,12],[0,13,1,13],[13,4,13,15],[15,4,15,15],[0,26,1,26],[0,27,1,27],[2,15,11,15],[0,19,1,19],[0,20,1,20],[0,21,1,21],[0,22,1,22],[0,23,1,23],[0,15,1,15],[0,17,1,17],[0,18,1,18],[0,24,1,24],[0,25,1,25],[0,14,1,14],[0,11,1,11]]}
["Critical Success Factors",null,null,null,"Your Property's Name","Competitor 1","Competitor 2","Competitor 3","Competitor 4","Competitor 5","Competitor 6","Competitor 7","Competitor 8","Competitor 9","Competitor 10",null,"Competitor 6","Your Property's Name","Competitor 1","Competitor 2","Competitor 3","Competitor 4","Competitor 5","Competitor 6","Competitor 7","Competitor 8","Competitor 9","Competitor 10",10,null,null,null,null,null,null,null,null,null,null,null,null,null,null,null,null,null,null,null,null,null,null,null,null,null,null,null,null,null,null,null,null,null,null,null,6]
["#","Factor","Weight",null,null,null,null,null,null,null,null,null,null,null,null,null,null,null,null,null,null,null,null,null,null,null,null,null,{"$f":"LARGE(R13:AB13,1)","v":0}]
[1,null,null,"Scores:",null,null,null,null,null,null,null,null,null,null,null,"Wt * Rtng:",null,{"$f":"IF($C3>0,$C3*E3,\"\")","v":""},{"$f":"IF($C3>0,$C3*F3,\"\")","v":""},{"$f":"IF($C3>0,$C3*G3,\"\")","v":""},{"$f":"IF($C3>0,$C3*H3,\"\")","v":""},{"$f":"IF($C3>0,$C3*I3,\"\")","v":""},{"$f":"IF($C3>0,$C3*J3,\"\")","v":""},{"$f":"IF($C3>0,$C3*K3,\"\")","v":""},{"$f":"IF($C3>0,$C3*L3,\"\")","v":""},{"$f":"IF($C3>0,$C3*M3,\"\")","v":""},{"$f":"IF($C3>0,$C3*N3,\"\")","v":""},{"$f":"IF($C3>0,$C3*O3,\"\")","v":""},{"$f":"LARGE(R13:AB13,2)","v":0}]
[2,null,null,null,null,null,null,null,null,null,null,null,null,null,null,null,null,"","","","","","","","","","","",{"$f":"LARGE(R13:AB13,3)","v":0}]
[3,null,null,null,null,null,null,null,null,null,null,null,null,null,null,null,null,"","","","","","","","","","","",{"$f":"LARGE(R13:AB13,4)","v":0}]
[4,null,null,null,null,null,null,null,null,null,null,null,null,null,null,null,null,"","","","","","","","","","","",{"$f":"LARGE(R13:AB13,5)","v":0}]
[5,null,null,null,null,null,null,null,null,null,null,null,null,null,null,null,null,"","","","","","","","","","","",{"$f":"LARGE(R13:AB13,6)","v":0}]
[6,null,null,null,null,null,null,null,null,null,null,null,null,null,null,null,null,"","","","","","","","","","","",{"$f":"LARGE(R13:AB13,7)","v":0}]
[7,null,null,null,null,null,null,null,null,null,null,null,null,null,null,null,null,"","","","","","","","","","","",{"$f":"LARGE(R13:AB13,8)","v":0}]
[8,null,null,null,null,null,null,null,null,null,null,null,null,null,null,null,null,"","","","","","","","","","","",{"$f":"LARGE(R13:AB13,9)","v":0}]
{"$rows_left_out":10}
{"sheet":"Summary","index":9,"n_rows":8,"n_cols":5,"rows_kept":8,"cut":false,"hidden":false,"merged":[[0,2,0,3],[0,4,1,4]]}
[null,{"$f":"YourProperty","v":"Your Property's Name"},"Top Competitor",null,"Relative Performance"]
["Analysis","% of Maximum","% of Maximum","Name"]
["Overall",{"$f":"Overall!R14","v":0},{"$f":"MAX(Overall!S14:AB14)","v":0},{"$f":"OFFSET(Overall!R1,0,MATCH(C3,Overall!S14:AB14,0))","v":"Competitor 1"},{"$f":"IF(LEN(A3)>0,IF(ABS(B3-C3)<0.05,\"Similar to best competitor\",IF(B3>=C3+0.05,\"Better than best competitor\",\"Worse than best competitor\")),\"\")","v":"Similar to best competitor"}]
["Sub Analysis A",{"$f":"'Sub Analysis A'!R14","v":0},{"$f":"MAX('Sub Analysis A'!S14:AB14)","v":0},{"$f":"OFFSET('Sub Analysis A'!R1,0,MATCH(C4,'Sub Analysis A'!S14:AB14,0))","v":"Competitor 1"},{"$f":"IF(LEN(A4)>0,IF(ABS(B4-C4)<0.05,\"Similar to best competitor\",IF(B4>=C4+0.05,\"Better than best competitor\",\"Worse than best competitor\")),\"\")","v":"Similar to best competitor"}]
["Sub Analysis B",{"$f":"'Sub Analysis B'!R14","v":0},{"$f":"MAX('Sub Analysis B'!S14:AB14)","v":0},{"$f":"OFFSET('Sub Analysis B'!R1,0,MATCH(C5,'Sub Analysis B'!S14:AB14,0))","v":"Competitor 1"},"Similar to best competitor"]
["Sub Analysis C",{"$f":"'Sub Analysis C'!R14","v":0},{"$f":"MAX('Sub Analysis C'!S14:AB14)","v":0},{"$f":"OFFSET('Sub Analysis C'!R1,0,MATCH(C6,'Sub Analysis C'!S14:AB14,0))","v":"Competitor 1"},"Similar to best competitor"]
["Sub Analysis D",{"$f":"'Sub Analysis D'!R14","v":0},{"$f":"MAX('Sub Analysis D'!S14:AB14)","v":0},{"$f":"OFFSET('Sub Analysis D'!R1,0,MATCH(C7,'Sub Analysis D'!S14:AB14,0))","v":"Competitor 1"},"Similar to best competitor"]
["Sub Analysis E",{"$f":"'Sub Analysis E'!R14","v":0},{"$f":"MAX('Sub Analysis E'!S14:AB14)","v":0},{"$f":"OFFSET('Sub Analysis E'!R1,0,MATCH(C8,'Sub Analysis E'!S14:AB14,0))","v":"Competitor 1"},"Similar to best competitor"]