{"text_format":"1","workbook":"xlsx","n_sheets":5,"sheets":["Disclaimer","Instructions","Options & Criteria","Results","Your Notes"],"not_rendered":{"charts":0,"images":0,"macros":1,"external_links":0,"defined_names":2,"comments":0,"pivot_tables":0},"unopened":[],"bounds":{"document_bytes":16777216,"sheet_cells":100000,"rows_first":2000,"rows_last":500,"rows_between":2000,"halvings":0,"cell_chars":16384,"cell_head_chars":4096},"cells_cut":0,"cells_raw":0,"read":"whole","date_system":"1900"}

{"sheet":"Disclaimer","index":0,"n_rows":98,"n_cols":1,"rows_kept":98,"cut":false,"hidden":false,"merged":[]}
["CHR TOOLS EVALUATION LICENSE--OPTIONS MATRIX"]
[]
["IMPORTANT --- READ CAREFULLY. This evaluation license agreement (\"Agreement\") is a legal contract between you (either an individual or a single business entity) and The Center for Hospitality Research at Cornell University (\"Licensor\") for the software product identified above, which includes computer software and, as applicable, associated media, printed materials, and \"online\" or electronic documentation (the \"Software Application\")."]
[]
["BY INSTALLING, COPYING, OR OTHERWISE USING THE SOFTWARE APPLICATION, YOU AGREE TO BE BOUND BY THE TERMS OF THIS AGREEMENT. IF YOU DO NOT AGREE TO THE TERMS OF THIS AGREEMENT, DO NOT INSTALL OR USE THE SOFTWARE APPLICATION."]
[]
["License Terms"]
[]
["Following acceptance of this Agreement and on-line registration with the Licensor, you may use, strictly for trial use and evaluation purposes only, one copy of the Software Application."]
[]
["You may not reverse engineer, decompile, disassemble, or otherwise translate the Software Application, except and only to the extent that such activity is expressly permitted by applicable law notwithstanding this limitation."]
[]
["The Software Application and related user documentation if any are proprietary products of Licensor protected under U.S. copyright law. All right, title, and interest in and to the Software Application, including associated intellectual property rights, are and shall remain with Licensor. This Agreement does not convey to you an interest in or to the Software Application, but only a limited right of use revocable in accordance with the terms of this Agreement."]
[]
["The Software Application is provided without charge under this evaluation license. The free trial period is of limited duration. Licensor may extend the free trial period, but reserves the right, at any time, to condition access on the payment of charges. Licensor may terminate access to the tool upon 30 days' prior notice."]
[]
["Licensor will not provide you with support services related to the Software Application, and is under no obligation to do so."]
[]
["You may not distribute copies of the Software Application to third parties or transfer any rights under this Agreement."]
[]
["Without prejudice to any other rights, Licensor may terminate this Agreement if you fail to comply with the terms and conditions of this Agreement. In such event, you must destroy all copies of the Software Application and all of its component parts."]
[]
["Governing Law"]
[]
["This Agreement shall be governed by the laws of the State of New York."]
[]
["Proprietary Rights"]
[]
["Copyright. All title and copyrights in and to the Software Application (including, without limitation, any images, photographs, animations, video, audio, music, text, and \"applets\" incorporated into the Software Application), the accompanying media and printed materials, and any copies of the Software Product are owned by Licensor or its suppliers. The Software Application is protected by copyrights laws and international treaty provisions. Therefore, you must treat the software Application like any other copyrighted material, subject to the provisions of this Agreement."]
[]
{"$rows_left_out":69}
{"sheet":"Instructions","index":1,"n_rows":20,"n_cols":3,"rows_kept":20,"cut":false,"hidden":false,"merged":[[3,0,3,2],[1,0,1,2],[9,0,9,2],[0,0,0,2]]}
["Options Matrix Tool--Instructions"]
["The purpose of the Options Matrix Tool is to assist managers in evaluating different options in a systematic way.  "]
[]
["On the \"Options & Criteria\" worksheet, you must do five things:"]
[null,"1)","Identify the options (alternatives) you are considering.  You must identify at least 2 and at most 5 options.  More detailed descriptions of the options are better.  "]
[null,"2)","Identify the criteria that are the most important for evaluating your options.  Too few or too many criteria may hamper effective decision making.  You will need to specify at least 2 and at most 6 criteria."]
[null,"3)","Assign a weight to each criterion.  A weight should represent the importance of the criterion.  The weights  must sum to 100 points."]
[null,"4)","Identify the minimum acceptable score for each criterion (see step 5 for scoring details).  This should reflect the minimum level of performance you deem acceptable for a criterion."]
[null,"5)","Rate each option on the criteria, using a scale from 1 to 10: 1 = very unfavorable (i.e., this option has the lowest possible performance on the criterion);   5 = neutral / medium (i.e., this option is okay, having a mid-level performance on this criterion); 10 = very favorable (i.e., this option has best possible performance on this criterion). "]
["Having performed the five steps listed above, you will find the results of the analysis on the \"Results\" worksheet.  On that sheet you will see your final option matrix, which provides the weighted rating of your options on the criteria you specified.  The option with the highest total score is the best.  Any option that does not meet the minimum score on a criterion (see step 4, above) will be flagged."]
[]
[]
[]
[]
["    "]
[]
[]
[]
[]
[" "]

{"sheet":"Options & Criteria","index":2,"n_rows":17,"n_cols":16,"rows_kept":17,"cut":false,"hidden":false,"merged":[[14,2,14,4],[15,2,15,4],[16,2,16,4],[3,3,3,7],[7,0,11,0]]}
[null,null,"# Options:",5,"[Select 2-5]"]
[null,null,"# Criteria:",5,"[Select 2-6]",null,null,null,null,null,null,null,{"$f":"SUM(B2:F2)","v":5}]
[null,null,null,null,null,null,null,null,null,null,null,null,{"$f":"SUM(B3:F3)","v":0}]
[null,null,null,"Criteria",null,null,null,null,null,null,null,null,{"$f":"SUM(B4:F4)","v":0}]
[null,null,"Description:","                          Increase revenue & profits                               ","Few staffing & scheduling challenges","Deliver consistent food & service, at a fair price","Enhance customer satisfaction and loyalty","Little lifestyle implications for chef/owner",null,null,null,null,{"$f":"SUM(B5:F5)","v":0},"Total",null,{"$f":"SUM(D6:G6)","v":90}]
[null,null,"Weight (out of 100 pts):",30,30,20,10,10,null,null,null,null,null,{"$f":"SUM(D6:H6)","v":100},null,{"$f":"COUNTA(D5:H5)","v":5}]
[null,null,"Minimum Desired Score (/10):",4,6,7,3,5,null,null,null,null,null,null,null,{"$f":"COUNTA(INDIRECT(\"c8:c\"&(D1+7)))","v":5}]
["Options",1,"Open for lunch on weekdays",10,3,5,7,3,null,null,null,null,null,null,null,{"$f":"COUNTA(D8:H12)","v":25}]
[null,2,"Open earlier for dinner on weekdays",9,8,10,7,8]
[null,3,"Open for brunch on Sunday, Sunday, Sunday",6,5,6,6,5]
[null,4,"Extend shoulder season usage of patio seating",8,10,9,8,10]
[null,5,"Increase prices",6,10,5,7,10]
[null,null,8,null,null,null,null,8]
[null,null,9]
[null,null,{"$f":"IF(P6<>D2,\"Some criteria are missing descriptions\",IF(P7<>D1,\"Some options are missing descriptions\",IF(N6 <>100,\"The weights must sum to 100\",IF(P8<>AlternativeCount*CriteriaCount,\"Some ratings (scores) are missing\",\"Ready to review results\"))))","v":"Ready to review results"}]
[null,null,"Provide values in the cells of this color"]
[null,null,"Rate (score) the options in the cells of this color, on a scale of 0 (worst) to 10 (best)"]

{"sheet":"Results","index":3,"n_rows":7,"n_cols":43,"rows_kept":7,"cut":false,"hidden":false,"merged":[[1,0,5,0]]}
[null,null,"Criteria >                                                                                                   ",{"$f":"'Options & Criteria'!D5","v":"                          Increase revenue & profits                               "},{"$f":"'Options & Criteria'!E5","v":"Few staffing & scheduling challenges"},{"$f":"'Options & Criteria'!F5","v":"Deliver consistent food & service, at a fair price"},{"$f":"'Options & Criteria'!G5","v":"Enhance customer satisfaction and loyalty"},{"$f":"'Options & Criteria'!H5","v":"Little lifestyle implications for chef/owner"},{"$f":"'Options & Criteria'!I5","v":0},{"$f":"'Options & Criteria'!J5","v":0},{"$f":"'Options & Criteria'!K5","v":0},{"$f":"'Options & Criteria'!L5","v":0},{"$f":"'Options & Criteria'!M5","v":0},null,"Overall Score (/100):","Ranking:","Potential Problems:",null,null,"The values below are for calc purposes",null,null,null,null,1,2,3,4,5,6,7,8,9,10,2,3,4,5,6,7,8,9,10]
["Options",1,{"$f":"IF(LEN('Options & Criteria'!C8)>0,'Options & Criteria'!C8,\"\")","v":"Open for lunch on weekdays"},{"$f":"'Options & Criteria'!D$6*'Options & Criteria'!D8/10","v":30},{"$f":"'Options & Criteria'!E$6*'Options & Criteria'!E8/10","v":9},{"$f":"'Options & Criteria'!F$6*'Options & Criteria'!F8/10","v":10},{"$f":"'Options & Criteria'!G$6*'Options & Criteria'!G8/10","v":7},{"$f":"'Options & Criteria'!H$6*'Options & Criteria'!H8/10","v":3},{"$f":"'Options & Criteria'!I$6*'Options & Criteria'!I8/10","v":0},{"$f":"'Options & Criteria'!J$6*'Options & Criteria'!J8/10","v":0},{"$f":"'Options & Criteria'!K$6*'Options & Criteria'!K8/10","v":0},{"$f":"'Options & Criteria'!L$6*'Options & Criteria'!L8/10","v":0},{"$f":"'Options & Criteria'!M$6*'Options & Criteria'!M8/10","v":0},null,{"$f":"SUM(D2:H2)","v":59},{"$f":"OFFSET($W$1,MATCH(O2,$T$2:$T$6,0),0)","v":4},{"$f":"IF(LEN(AQ2)>0,\"Below the minimum desired score for: \" &AQ2,\"None!\")","v":"Below the minimum desired score for: Few staffing & scheduling challenges; Deliver consistent food & service, at a fair price; Little lifestyle implications for chef/owner"},null,null,{"$f":"MAX(O2:O6)","v":90},1,{"$f":"COUNTIF($O$2:$O$6,\"=\"&T2)","v":1},1,null,{"$f":"IF(AND(ROW(D2)<=AlternativeCount+1,'Options & Criteria'!D8<'Options & Criteria'!D$7),'Options & Criteria'!D$5,\"\")","v":""},{"$f":"IF(AND(ROW(E2)<=AlternativeCount+1,'Options & Criteria'!E8<'Options & Criteria'!E$7),'Options & Criteria'!E$5,\"\")","v":"Few staffing & scheduling challenges"},{"$f":"IF(AND(ROW(F2)<=AlternativeCount+1,'Options & Criteria'!F8<'Options & Criteria'!F$7),'Options & Criteria'!F$5,\"\")","v":"Deliver consistent food & service, at a fair price"},{"$f":"IF(AND(ROW(G2)<=AlternativeCount+1,'Options & Criteria'!G8<'Options & Criteria'!G$7),'Options & Criteria'!G$5,\"\")","v":""},{"$f":"IF(AND(ROW(H2)<=AlternativeCount+1,'Options & Criteria'!H8<'Options & Criteria'!H$7),'Options & Criteria'!H$5,\"\")","v":"Little lifestyle implications for chef/owner"},{"$f":"IF(AND(ROW(I2)<=AlternativeCount+1,'Options & Criteria'!I8<'Options & Criteria'!I$7),'Options & Criteria'!I$5,\"\")","v":""},{"$f":"IF(AND(ROW(J2)<=AlternativeCount+1,'Options & Criteria'!J8<'Options & Criteria'!J$7),'Options & Criteria'!J$5,\"\")","v":""},{"$f":"IF(AND(ROW(K2)<=AlternativeCount+1,'Options & Criteria'!K8<'Options & Criteria'!K$7),'Options & Criteria'!K$5,\"\")","v":""},{"$f":"IF(AND(ROW(L2)<=AlternativeCount+1,'Options & Criteria'!L8<'Options & Criteria'!L$7),'Options & Criteria'!L$5,\"\")","v":""},{"$f":"IF(AND(ROW(M2)<=AlternativeCount+1,'Options & Criteria'!M8<'Options & Criteria'!M$7),'Options & Criteria'!M$5,\"\")","v":""},{"$f":"IF(LEN(Z2)>0,IF(LEN(Y2)>0,Y2&\"; \",\"\")&Z2,Y2)","v":"Few staffing & scheduling challenges"},{"$f":"IF(LEN(AA2)>0,IF(LEN(AI2)>0,AI2&\"; \",\"\")&AA2,AI2)","v":"Few staffing & scheduling challenges; Deliver consistent food & service, at a fair price"},{"$f":"IF(LEN(AB2)>0,IF(LEN(AJ2)>0,AJ2&\"; \",\"\")&AB2,AJ2)","v":"Few staffing & scheduling challenges; Deliver consistent food & service, at a fair price"},"Few staffing & scheduling challenges; Deliver consistent food & service, at a fair price; Little lifestyle implications for chef/owner","Few staffing & scheduling challenges; Deliver consistent food & service, at a fair price; Little lifestyle implications for chef/owner","Few staffing & scheduling challenges; Deliver consistent food & service, at a fair price; Little lifestyle implications for chef/owner","Few staffing & scheduling challenges; Deliver consistent food & service, at a fair price; Little lifestyle implications for chef/owner","Few staffing & scheduling challenges; Deliver consistent food & service, at a fair price; Little lifestyle implications for chef/owner","Few staffing & scheduling challenges; Deliver consistent food & service, at a fair price; Little lifestyle implications for chef/owner"]
[null,2,{"$f":"IF(LEN('Options & Criteria'!C9)>0,'Options & Criteria'!C9,\"\")","v":"Open earlier for dinner on weekdays"},{"$f":"'Options & Criteria'!D$6*'Options & Criteria'!D9/10","v":27},{"$f":"'Options & Criteria'!E$6*'Options & Criteria'!E9/10","v":24},{"$f":"'Options & Criteria'!F$6*'Options & Criteria'!F9/10","v":20},{"$f":"'Options & Criteria'!G$6*'Options & Criteria'!G9/10","v":7},{"$f":"'Options & Criteria'!H$6*'Options & Criteria'!H9/10","v":8},{"$f":"'Options & Criteria'!I$6*'Options & Criteria'!I9/10","v":0},{"$f":"'Options & Criteria'!J$6*'Options & Criteria'!J9/10","v":0},{"$f":"'Options & Criteria'!K$6*'Options & Criteria'!K9/10","v":0},{"$f":"'Options & Criteria'!L$6*'Options & Criteria'!L9/10","v":0},{"$f":"'Options & Criteria'!M$6*'Options & Criteria'!M9/10","v":0},null,{"$f":"SUM(D3:H3)","v":86},{"$f":"OFFSET($W$1,MATCH(O3,$T$2:$T$6,0),0)","v":2},{"$f":"IF(LEN(AQ3)>0,\"Below the minimum desired score for: \" &AQ3,\"None!\")","v":"None!"},null,null,{"$f":"LARGE($O$2:$O$6,U3)","v":86},2,{"$f":"COUNTIF($O$2:$O$6,\"=\"&T3)","v":1},{"$f":"IF(T3<>T2,W2+V2,W2)","v":2},null,{"$f":"IF(AND(ROW(D3)<=AlternativeCount+1,'Options & Criteria'!D9<'Options & Criteria'!D$7),'Options & Criteria'!D$5,\"\")","v":""},{"$f":"IF(AND(ROW(E3)<=AlternativeCount+1,'Options & Criteria'!E9<'Options & Criteria'!E$7),'Options & Criteria'!E$5,\"\")","v":""},{"$f":"IF(AND(ROW(F3)<=AlternativeCount+1,'Options & Criteria'!F9<'Options & Criteria'!F$7),'Options & Criteria'!F$5,\"\")","v":""},{"$f":"IF(AND(ROW(G3)<=AlternativeCount+1,'Options & Criteria'!G9<'Options & Criteria'!G$7),'Options & Criteria'!G$5,\"\")","v":""},{"$f":"IF(AND(ROW(H3)<=AlternativeCount+1,'Options & Criteria'!H9<'Options & Criteria'!H$7),'Options & Criteria'!H$5,\"\")","v":""},{"$f":"IF(AND(ROW(I3)<=AlternativeCount+1,'Options & Criteria'!I9<'Options & Criteria'!I$7),'Options & Criteria'!I$5,\"\")","v":""},{"$f":"IF(AND(ROW(J3)<=AlternativeCount+1,'Options & Criteria'!J9<'Options & Criteria'!J$7),'Options & Criteria'!J$5,\"\")","v":""},{"$f":"IF(AND(ROW(K3)<=AlternativeCount+1,'Options & Criteria'!K9<'Options & Criteria'!K$7),'Options & Criteria'!K$5,\"\")","v":""},{"$f":"IF(AND(ROW(L3)<=AlternativeCount+1,'Options & Criteria'!L9<'Options & Criteria'!L$7),'Options & Criteria'!L$5,\"\")","v":""},{"$f":"IF(AND(ROW(M3)<=AlternativeCount+1,'Options & Criteria'!M9<'Options & Criteria'!M$7),'Options & Criteria'!M$5,\"\")","v":""},{"$f":"IF(LEN(Z3)>0,IF(LEN(Y3)>0,Y3&\"; \",\"\")&Z3,Y3)","v":""},{"$f":"IF(LEN(AA3)>0,IF(LEN(AI3)>0,AI3&\"; \",\"\")&AA3,AI3)","v":""},{"$f":"IF(LEN(AB3)>0,IF(LEN(AJ3)>0,AJ3&\"; \",\"\")&AB3,AJ3)","v":""},{"$f":"IF(LEN(AC3)>0,IF(LEN(AK3)>0,AK3&\"; \",\"\")&AC3,AK3)","v":""},{"$f":"IF(LEN(AD3)>0,IF(LEN(AL3)>0,AL3&\"; \",\"\")&AD3,AL3)","v":""},{"$f":"IF(LEN(AE3)>0,IF(LEN(AM3)>0,AM3&\"; \",\"\")&AE3,AM3)","v":""},{"$f":"IF(LEN(AF3)>0,IF(LEN(AN3)>0,AN3&\"; \",\"\")&AF3,AN3)","v":""},{"$f":"IF(LEN(AG3)>0,IF(LEN(AO3)>0,AO3&\"; \",\"\")&AG3,AO3)","v":""},{"$f":"IF(LEN(AH3)>0,IF(LEN(AP3)>0,AP3&\"; \",\"\")&AH3,AP3)","v":""}]
[null,3,{"$f":"IF(LEN('Options & Criteria'!C10)>0,'Options & Criteria'!C10,\"\")","v":"Open for brunch on Sunday, Sunday, Sunday"},{"$f":"'Options & Criteria'!D$6*'Options & Criteria'!D10/10","v":18},{"$f":"'Options & Criteria'!E$6*'Options & Criteria'!E10/10","v":15},{"$f":"'Options & Criteria'!F$6*'Options & Criteria'!F10/10","v":12},{"$f":"'Options & Criteria'!G$6*'Options & Criteria'!G10/10","v":6},{"$f":"'Options & Criteria'!H$6*'Options & Criteria'!H10/10","v":5},{"$f":"'Options & Criteria'!I$6*'Options & Criteria'!I10/10","v":0},{"$f":"'Options & Criteria'!J$6*'Options & Criteria'!J10/10","v":0},{"$f":"'Options & Criteria'!K$6*'Options & Criteria'!K10/10","v":0},{"$f":"'Options & Criteria'!L$6*'Options & Criteria'!L10/10","v":0},{"$f":"'Options & Criteria'!M$6*'Options & Criteria'!M10/10","v":0},null,{"$f":"SUM(D4:H4)","v":56},5,"Below the minimum desired score for: Few staffing & scheduling challenges; Deliver consistent food & service, at a fair price",null,null,{"$f":"LARGE($O$2:$O$6,U4)","v":75},3,1,{"$f":"IF(T4<>T3,W3+V3,W3)","v":3},null,{"$f":"IF(AND(ROW(D4)<=AlternativeCount+1,'Options & Criteria'!D10<'Options & Criteria'!D$7),'Options & Criteria'!D$5,\"\")","v":""},{"$f":"IF(AND(ROW(E4)<=AlternativeCount+1,'Options & Criteria'!E10<'Options & Criteria'!E$7),'Options & Criteria'!E$5,\"\")","v":"Few staffing & scheduling challenges"},{"$f":"IF(AND(ROW(F4)<=AlternativeCount+1,'Options & Criteria'!F10<'Options & Criteria'!F$7),'Options & Criteria'!F$5,\"\")","v":"Deliver consistent food & service, at a fair price"},{"$f":"IF(AND(ROW(G4)<=AlternativeCount+1,'Options & Criteria'!G10<'Options & Criteria'!G$7),'Options & Criteria'!G$5,\"\")","v":""},{"$f":"IF(AND(ROW(H4)<=AlternativeCount+1,'Options & Criteria'!H10<'Options & Criteria'!H$7),'Options & Criteria'!H$5,\"\")","v":""},{"$f":"IF(AND(ROW(I4)<=AlternativeCount+1,'Options & Criteria'!I10<'Options & Criteria'!I$7),'Options & Criteria'!I$5,\"\")","v":""},{"$f":"IF(AND(ROW(J4)<=AlternativeCount+1,'Options & Criteria'!J10<'Options & Criteria'!J$7),'Options & Criteria'!J$5,\"\")","v":""},{"$f":"IF(AND(ROW(K4)<=AlternativeCount+1,'Options & Criteria'!K10<'Options & Criteria'!K$7),'Options & Criteria'!K$5,\"\")","v":""},{"$f":"IF(AND(ROW(L4)<=AlternativeCount+1,'Options & Criteria'!L10<'Options & Criteria'!L$7),'Options & Criteria'!L$5,\"\")","v":""},{"$f":"IF(AND(ROW(M4)<=AlternativeCount+1,'Options & Criteria'!M10<'Options & Criteria'!M$7),'Options & Criteria'!M$5,\"\")","v":""},"Few staffing & scheduling challenges","Few staffing & scheduling challenges; Deliver consistent food & service, at a fair price","Few staffing & scheduling challenges; Deliver consistent food & service, at a fair price","Few staffing & scheduling challenges; Deliver consistent food & service, at a fair price","Few staffing & scheduling challenges; Deliver consistent food & service, at a fair price","Few staffing & scheduling challenges; Deliver consistent food & service, at a fair price","Few staffing & scheduling challenges; Deliver consistent food & service, at a fair price","Few staffing & scheduling challenges; Deliver consistent food & service, at a fair price","Few staffing & scheduling challenges; Deliver consistent food & service, at a fair price"]
[null,4,{"$f":"IF(LEN('Options & Criteria'!C11)>0,'Options & Criteria'!C11,\"\")","v":"Extend shoulder season usage of patio seating"},{"$f":"'Options & Criteria'!D$6*'Options & Criteria'!D11/10","v":24},{"$f":"'Options & Criteria'!E$6*'Options & Criteria'!E11/10","v":30},{"$f":"'Options & Criteria'!F$6*'Options & Criteria'!F11/10","v":18},{"$f":"'Options & Criteria'!G$6*'Options & Criteria'!G11/10","v":8},{"$f":"'Options & Criteria'!H$6*'Options & Criteria'!H11/10","v":10},{"$f":"'Options & Criteria'!I$6*'Options & Criteria'!I11/10","v":0},{"$f":"'Options & Criteria'!J$6*'Options & Criteria'!J11/10","v":0},{"$f":"'Options & Criteria'!K$6*'Options & Criteria'!K11/10","v":0},{"$f":"'Options & Criteria'!L$6*'Options & Criteria'!L11/10","v":0},{"$f":"'Options & Criteria'!M$6*'Options & Criteria'!M11/10","v":0},null,{"$f":"SUM(D5:H5)","v":90},1,"None!",null,null,59,4,1,4,null,{"$f":"IF(AND(ROW(D5)<=AlternativeCount+1,'Options & Criteria'!D11<'Options & Criteria'!D$7),'Options & Criteria'!D$5,\"\")","v":""},{"$f":"IF(AND(ROW(E5)<=AlternativeCount+1,'Options & Criteria'!E11<'Options & Criteria'!E$7),'Options & Criteria'!E$5,\"\")","v":""},{"$f":"IF(AND(ROW(F5)<=AlternativeCount+1,'Options & Criteria'!F11<'Options & Criteria'!F$7),'Options & Criteria'!F$5,\"\")","v":""},{"$f":"IF(AND(ROW(G5)<=AlternativeCount+1,'Options & Criteria'!G11<'Options & Criteria'!G$7),'Options & Criteria'!G$5,\"\")","v":""},{"$f":"IF(AND(ROW(H5)<=AlternativeCount+1,'Options & Criteria'!H11<'Options & Criteria'!H$7),'Options & Criteria'!H$5,\"\")","v":""},{"$f":"IF(AND(ROW(I5)<=AlternativeCount+1,'Options & Criteria'!I11<'Options & Criteria'!I$7),'Options & Criteria'!I$5,\"\")","v":""},{"$f":"IF(AND(ROW(J5)<=AlternativeCount+1,'Options & Criteria'!J11<'Options & Criteria'!J$7),'Options & Criteria'!J$5,\"\")","v":""},{"$f":"IF(AND(ROW(K5)<=AlternativeCount+1,'Options & Criteria'!K11<'Options & Criteria'!K$7),'Options & Criteria'!K$5,\"\")","v":""},{"$f":"IF(AND(ROW(L5)<=AlternativeCount+1,'Options & Criteria'!L11<'Options & Criteria'!L$7),'Options & Criteria'!L$5,\"\")","v":""},{"$f":"IF(AND(ROW(M5)<=AlternativeCount+1,'Options & Criteria'!M11<'Options & Criteria'!M$7),'Options & Criteria'!M$5,\"\")","v":""},"","","","","","","","",""]
[null,5,{"$f":"IF(LEN('Options & Criteria'!C12)>0,'Options & Criteria'!C12,\"\")","v":"Increase prices"},{"$f":"'Options & Criteria'!D$6*'Options & Criteria'!D12/10","v":18},{"$f":"'Options & Criteria'!E$6*'Options & Criteria'!E12/10","v":30},{"$f":"'Options & Criteria'!F$6*'Options & Criteria'!F12/10","v":10},{"$f":"'Options & Criteria'!G$6*'Options & Criteria'!G12/10","v":7},{"$f":"'Options & Criteria'!H$6*'Options & Criteria'!H12/10","v":10},{"$f":"'Options & Criteria'!I$6*'Options & Criteria'!I12/10","v":0},{"$f":"'Options & Criteria'!J$6*'Options & Criteria'!J12/10","v":0},{"$f":"'Options & Criteria'!K$6*'Options & Criteria'!K12/10","v":0},{"$f":"'Options & Criteria'!L$6*'Options & Criteria'!L12/10","v":0},{"$f":"'Options & Criteria'!M$6*'Options & Criteria'!M12/10","v":0},null,{"$f":"SUM(D6:H6)","v":75},3,"Below the minimum desired score for: Deliver consistent food & service, at a fair price",null,null,56,5,1,5,null,{"$f":"IF(AND(ROW(D6)<=AlternativeCount+1,'Options & Criteria'!D12<'Options & Criteria'!D$7),'Options & Criteria'!D$5,\"\")","v":""},{"$f":"IF(AND(ROW(E6)<=AlternativeCount+1,'Options & Criteria'!E12<'Options & Criteria'!E$7),'Options & Criteria'!E$5,\"\")","v":""},{"$f":"IF(AND(ROW(F6)<=AlternativeCount+1,'Options & Criteria'!F12<'Options & Criteria'!F$7),'Options & Criteria'!F$5,\"\")","v":"Deliver consistent food & service, at a fair price"},{"$f":"IF(AND(ROW(G6)<=AlternativeCount+1,'Options & Criteria'!G12<'Options & Criteria'!G$7),'Options & Criteria'!G$5,\"\")","v":""},{"$f":"IF(AND(ROW(H6)<=AlternativeCount+1,'Options & Criteria'!H12<'Options & Criteria'!H$7),'Options & Criteria'!H$5,\"\")","v":""},{"$f":"IF(AND(ROW(I6)<=AlternativeCount+1,'Options & Criteria'!I12<'Options & Criteria'!I$7),'Options & Criteria'!I$5,\"\")","v":""},{"$f":"IF(AND(ROW(J6)<=AlternativeCount+1,'Options & Criteria'!J12<'Options & Criteria'!J$7),'Options & Criteria'!J$5,\"\")","v":""},{"$f":"IF(AND(ROW(K6)<=AlternativeCount+1,'Options & Criteria'!K12<'Options & Criteria'!K$7),'Options & Criteria'!K$5,\"\")","v":""},{"$f":"IF(AND(ROW(L6)<=AlternativeCount+1,'Options & Criteria'!L12<'Options & Criteria'!L$7),'Options & Criteria'!L$5,\"\")","v":""},{"$f":"IF(AND(ROW(M6)<=AlternativeCount+1,'Options & Criteria'!M12<'Options & Criteria'!M$7),'Options & Criteria'!M$5,\"\")","v":""},"","Deliver consistent food & service, at a fair price","Deliver consistent food & service, at a fair price","Deliver consistent food & service, at a fair price","Deliver consistent food & service, at a fair price","Deliver consistent food & service, at a fair price","Deliver consistent food & service, at a fair price","Deliver consistent food & service, at a fair price","Deliver consistent food & service, at a fair price"]
[null,null,null,null,null,null,null,null,null,null,null,null,null,null,null,null,null,null,null,null,null,null,null,null,{"$f":"IF(AND(ROW(D7)<=AlternativeCount+1,'Options & Criteria'!D13<'Options & Criteria'!$D12),'Options & Criteria'!$D10,\"\")","v":""}]

{"sheet":"Your Notes","index":4,"n_rows":0,"n_cols":0,"rows_kept":0,"cut":false,"hidden":false,"merged":[]}