{"text_format":"1","workbook":"xlsx","n_sheets":10,"sheets":["Disclaimer","Inputs, Part 1","Inputs, Part 2","Discount Calculation","Cht--Party Size","Cht--Arrivals","Results","cht-Value by Pty Vol","cht-Value by Party Count","Recommended Table Mix"],"not_rendered":{"charts":8,"images":0,"macros":1,"external_links":0,"defined_names":15,"comments":2,"pivot_tables":0},"unopened":[{"sheet":"Cht--Party Size","index":4,"reason":"not_a_worksheet"},{"sheet":"Cht--Arrivals","index":5,"reason":"not_a_worksheet"},{"sheet":"cht-Value by Pty Vol","index":7,"reason":"not_a_worksheet"},{"sheet":"cht-Value by Party Count","index":8,"reason":"not_a_worksheet"}],"bounds":{"document_bytes":16777216,"sheet_cells":100000,"rows_first":2000,"rows_last":500,"rows_between":2000,"halvings":0,"cell_chars":16384,"cell_head_chars":4096},"cells_cut":0,"cells_raw":0,"read":"whole","date_system":"1900"}

{"sheet":"Disclaimer","index":0,"n_rows":98,"n_cols":1,"rows_kept":98,"cut":false,"hidden":false,"merged":[]}
["CHR TOOLS EVALUATION LICENSE"]
[]
["IMPORTANT --- READ CAREFULLY. This evaluation license agreement (\"Agreement\") is a legal contract between you (either an individual or a single business entity) and The Center for Hospitality Research at Cornell University (\"Licensor\") for the software product identified above, which includes computer software and, as applicable, associated media, printed materials, and \"online\" or electronic documentation (the \"Software Application\")."]
[]
["BY INSTALLING, COPYING, OR OTHERWISE USING THE SOFTWARE APPLICATION, YOU AGREE TO BE BOUND BY THE TERMS OF THIS AGREEMENT. IF YOU DO NOT AGREE TO THE TERMS OF THIS AGREEMENT, DO NOT INSTALL OR USE THE SOFTWARE APPLICATION."]
[]
["License Terms"]
[]
["Following acceptance of this Agreement and on-line registration with the Licensor, you may use, strictly for trial use and evaluation purposes only, one copy of the Software Application."]
[]
["You may not reverse engineer, decompile, disassemble, or otherwise translate the Software Application, except and only to the extent that such activity is expressly permitted by applicable law notwithstanding this limitation."]
[]
["The Software Application and related user documentation if any are proprietary products of Licensor protected under U.S. copyright law. All right, title, and interest in and to the Software Application, including associated intellectual property rights, are and shall remain with Licensor. This Agreement does not convey to you an interest in or to the Software Application, but only a limited right of use revocable in accordance with the terms of this Agreement."]
[]
["The Software Application is provided without charge under this evaluation license. The free trial period is of limited duration. Licensor may extend the free trial period, but reserves the right, at any time, to condition access on the payment of charges. Licensor may terminate access to the tool upon 30 days' prior notice."]
{"$rows_left_out":84}
{"sheet":"Inputs, Part 1","index":1,"n_rows":32,"n_cols":34,"rows_kept":32,"cut":false,"hidden":false,"merged":[[1,6,1,7],[1,8,2,8],[24,26,25,26],[28,10,28,12],[0,19,0,20],[1,19,2,19],[1,20,2,20],[27,10,27,12],[7,22,9,22],[10,22,12,22],[13,22,17,22],[18,22,22,22],[25,10,25,12],[1,15,2,15],[23,22,25,22],[24,24,25,25],[3,22,6,22],[1,24,2,24],[23,24,23,25],[25,0,25,5],[0,0,0,8],[1,10,2,10],[1,11,2,11],[1,12,2,12],[1,0,2,0],[24,10,24,12],[23,10,23,12],[1,1,2,1],[1,2,2,2],[1,3,2,3],[24,4,24,5],[1,4,1,5],[1,25,2,25],[1,26,2,26],[0,24,0,26],[0,10,0,13],[0,16,0,18],[1,17,1,18],[1,16,2,16],[1,13,2,13],[1,22,2,22]]}
["Party-Related Data",null,null,null,null,null,null,null,null,null,"Table-Related Data",null,null,null,null,null,"Expected Number of Party Arrivals, by Period",null,null,"With a Target Net Value of the Special",null,null,"Instructions",null,"Party-Size Related Calculations",null,null,null,null,100,"Number Days",200,100,100]
["Party Size","Probability","Cumulative Probability","Party Value","Service Duration w/o Special (minutes)",null,"Service Duration w Special (minutes)",null,"Max Tolerable Wait",null,"# Seats","Space Required","Valid to Use?","Number",null,"15-Minute Interval","Without Special (Status Quo)","Estimated Arrivals With Special In Effect",null,"Parties Lost to the Special","Proportion of Total Parties Wanting the Special who want it in the Period",null,"1) Specify the data in the light blue colored cells on this sheet.",null,"Available Seats","Seated in Table","Captured $",null,null,30,"Maximum Number of Parties Waiting:",30,30,30]
[null,null,null,null,"Mean","Standard Deviation","Mean","Standard Deviation",null,null,null,null,null,null,null,null,null,"Existing + Wants Special","New + Wants Special",null,null,null,null,null,null,null,null,null,null,null,null,20]
[1,0.08,{"$f":"B4","v":0.08},10,60,12,{"$f":"E4","v":60},{"$f":"F4","v":12},30,null,1,1.625,false,0,null,"18:00:00",1,0.25,2,0.25,0.25,null,"2) If customers will be picking their own tables, specify the data in the light blue colored cells on the 'Inputs, Part 2' sheet.",null,{"$f":"IF(M4,K4,\"-\")","v":"-"},{"$f":"IF(MIN(Y4:$Y$23)=0,\"n/a\",MIN(Y4:$Y$23))","v":2},{"$f":"IF(Z4<1000,D4,\"\")","v":10},null,null,null,"Update Performance Graphs (minutes)",15]
[2,0.25,{"$f":"C4+B5","v":0.33},20,65,13,{"$f":"E5","v":65},{"$f":"F5","v":13},35,null,2,3.25,true,4,null,{"$f":"P4+15/1440","v":"18:15:00"},1,0.25,2,0.25,0.35,null,null,null,{"$f":"IF(M5,K5,\"-\")","v":2},{"$f":"IF(MIN(Y5:$Y$23)=0,\"n/a\",MIN(Y5:$Y$23))","v":2},20,null,null,null,"Start Collecting Statistics at Minute:",1000]
[3,0.11,0.44,30,70,14,70,14,40,null,3,4.875,false,0,null,{"$f":"P5+15/1440","v":"18:30:00"},1.5,0.25,2,0.25,0.4,null,null,null,"-",{"$f":"IF(MIN(Y6:$Y$23)=0,\"n/a\",MIN(Y6:$Y$23))","v":4},30,null,null,1,"Wait rule",1,1,1]
[4,0.19,0.63,40,75,15,75,15,45,null,4,6.5,true,3,null,"18:45:00",2,null,null,null,null,null,null,null,4,{"$f":"IF(MIN(Y7:$Y$23)=0,\"n/a\",MIN(Y7:$Y$23))","v":4},40,null,null,false,"create history",false,false,false]
[5,0.16,0.79,50,80,16,80,16,50,null,5,8.125,false,0,null,"19:00:00",2,null,null,null,null,null,"3) If desired, enter the existing table mix in the dark blue colored cells.",null,"-",{"$f":"IF(MIN(Y8:$Y$23)=0,\"n/a\",MIN(Y8:$Y$23))","v":6},50,null,null,null,"use history"]
[6,0.11,0.9,60,85,17,85,17,60,null,6,9.75,true,2,null,"19:15:00",2,null,null,null,null,null,null,null,6,{"$f":"IF(MIN(Y9:$Y$23)=0,\"n/a\",MIN(Y9:$Y$23))","v":6},60,null,null,true,"optimize table mix",true,true,false]
[7,0.06,0.96,70,90,18,90,18,65,null,7,11.375,false,0,null,"19:30:00",2.5,null,null,null,null,null,null,null,"-",{"$f":"IF(MIN(Y10:$Y$23)=0,\"n/a\",MIN(Y10:$Y$23))","v":8},70,null,null,null,null,0,15,15]
[8,0.02,0.98,80,95,19,95,19,75,null,8,13,true,1,null,"19:45:00",3,null,null,null,null,null,"4) The estimated value of special will be calculated in the columns to the right.",null,8,{"$f":"IF(MIN(Y11:$Y$23)=0,\"n/a\",MIN(Y11:$Y$23))","v":8},80]
[9,0.01,0.99,90,100,20,100,20,75,null,9,14.625,false,0,null,"20:00:00",3,null,null,null,null,null,null,null,"-",{"$f":"IF(MIN(Y12:$Y$23)=0,\"n/a\",MIN(Y12:$Y$23))","v":10},90]
[10,0.01,1,100,105,21,105,21,80,null,10,16.25,true,1,null,"20:15:00",3,null,null,null,null,null,null,null,10,{"$f":"IF(MIN(Y13:$Y$23)=0,\"n/a\",MIN(Y13:$Y$23))","v":10},100]
[11,0,{"$f":"C13+B14","v":1},null,null,null,null,null,null,null,11,17.875,false,0,null,"20:30:00",3,null,null,null,null,null,"5) Click the \"Evaluate the Special\" button to bring up the simulator interface form, where you specify additional parameters.",null,"-",{"$f":"IF(MIN(Y14:$Y$23)=0,\"n/a\",MIN(Y14:$Y$23))","v":"n/a"},""]
[12,0,1,null,null,null,null,null,null,null,12,19.5,false,0,null,"20:45:00",2.5,null,null,null,null,null,null,null,"-",{"$f":"IF(MIN(Y15:$Y$23)=0,\"n/a\",MIN(Y15:$Y$23))","v":"n/a"},""]
{"$rows_left_out":18}
{"sheet":"Inputs, Part 2","index":2,"n_rows":22,"n_cols":23,"rows_kept":22,"cut":false,"hidden":false,"merged":[[0,1,0,20],[0,0,1,0]]}
["Party Size","Probability of the Party Self-Selecting a Table of the Specified Number of Seats"]
[null,1,2,3,4,5,6,7,8,9,10,11,12,13,14,15,16,17,18,19,20,"Total"]
[1,null,0.76,null,0.15,null,0.05,null,0.03,null,0.01,null,null,null,null,null,null,null,null,null,null,{"$f":"SUM(B3:U3)","v":1},{"$f":"IF(AND(V3<>1,'Inputs, Part 1'!B4>0,'Inputs, Part 1'!$AE$6=3),\"WARNING: The probabilities for a party size of X should sum to 1.0\",\"\")","v":""}]
[2,null,0.64,null,0.2,null,0.1,null,0.05,null,0.01,null,null,null,null,null,null,null,null,null,null,{"$f":"SUM(B4:U4)","v":1},{"$f":"IF(AND(V4<>1,'Inputs, Part 1'!B5>0,'Inputs, Part 1'!$AE$6=3),\"WARNING: The probabilities for a party size of X should sum to 1.0\",\"\")","v":""}]
[3,null,null,null,0.77,null,0.15,null,0.05,null,0.03,null,null,null,null,null,null,null,null,null,null,1,{"$f":"IF(AND(V5<>1,'Inputs, Part 1'!B6>0,'Inputs, Part 1'!$AE$6=3),\"WARNING: The probabilities for a party size of X should sum to 1.0\",\"\")","v":""}]
[4,null,null,null,0.65,null,0.2,null,0.1,null,0.05,null,null,null,null,null,null,null,null,null,null,1,{"$f":"IF(AND(V6<>1,'Inputs, Part 1'!B7>0,'Inputs, Part 1'!$AE$6=3),\"WARNING: The probabilities for a party size of X should sum to 1.0\",\"\")","v":""}]
[5,null,null,null,null,null,0.8,null,0.15,null,0.05,null,null,null,null,null,null,null,null,null,null,1,{"$f":"IF(AND(V7<>1,'Inputs, Part 1'!B8>0,'Inputs, Part 1'!$AE$6=3),\"WARNING: The probabilities for a party size of X should sum to 1.0\",\"\")","v":""}]
[6,null,null,null,null,null,0.7,null,0.2,null,0.1,null,null,null,null,null,null,null,null,null,null,0.99999999999999989,{"$f":"IF(AND(V8<>1,'Inputs, Part 1'!B9>0,'Inputs, Part 1'!$AE$6=3),\"WARNING: The probabilities for a party size of X should sum to 1.0\",\"\")","v":""}]
[7,null,null,null,null,null,null,null,0.85,null,0.15,null,null,null,null,null,null,null,null,null,null,1,{"$f":"IF(AND(V9<>1,'Inputs, Part 1'!B10>0,'Inputs, Part 1'!$AE$6=3),\"WARNING: The probabilities for a party size of X should sum to 1.0\",\"\")","v":""}]
[8,null,null,null,null,null,null,null,0.8,null,0.2,null,null,null,null,null,null,null,null,null,null,1,{"$f":"IF(AND(V10<>1,'Inputs, Part 1'!B11>0,'Inputs, Part 1'!$AE$6=3),\"WARNING: The probabilities for a party size of X should sum to 1.0\",\"\")","v":""}]
[9,null,null,null,null,null,null,null,null,null,1,null,null,null,null,null,null,null,null,null,null,1,{"$f":"IF(AND(V11<>1,'Inputs, Part 1'!B12>0,'Inputs, Part 1'!$AE$6=3),\"WARNING: The probabilities for a party size of X should sum to 1.0\",\"\")","v":""}]
[10,null,null,null,null,null,null,null,null,null,1,null,null,null,null,null,null,null,null,null,null,1,{"$f":"IF(AND(V12<>1,'Inputs, Part 1'!B13>0,'Inputs, Part 1'!$AE$6=3),\"WARNING: The probabilities for a party size of X should sum to 1.0\",\"\")","v":""}]
[11,null,null,null,null,null,null,null,null,null,null,null,null,null,null,null,null,null,null,null,null,0,{"$f":"IF(AND(V13<>1,'Inputs, Part 1'!B14>0,'Inputs, Part 1'!$AE$6=3),\"WARNING: The probabilities for a party size of X should sum to 1.0\",\"\")","v":""}]
[12,null,null,null,null,null,null,null,null,null,null,null,null,null,null,null,null,null,null,null,null,0,{"$f":"IF(AND(V14<>1,'Inputs, Part 1'!B15>0,'Inputs, Part 1'!$AE$6=3),\"WARNING: The probabilities for a party size of X should sum to 1.0\",\"\")","v":""}]
[13,null,null,null,null,null,null,null,null,null,null,null,null,null,null,null,null,null,null,null,null,0,{"$f":"IF(AND(V15<>1,'Inputs, Part 1'!B16>0,'Inputs, Part 1'!$AE$6=3),\"WARNING: The probabilities for a party size of X should sum to 1.0\",\"\")","v":""}]
{"$rows_left_out":8}
{"sheet":"Discount Calculation","index":3,"n_rows":9,"n_cols":5,"rows_kept":9,"cut":false,"hidden":false,"merged":[[0,0,0,4],[1,1,1,2],[1,3,1,4],[7,0,7,1],[8,0,8,3]]}
["To calculate the Net Discount Percentage, provide the revenue (and cost) information for a typical party."]
[null,"Full-Fare (Original)",null,"With the Special"]
[null,"Revenue","Variable Cost","Revenue","Variable Cost"]
["Food",50,33.33,37.5,33.33]
["Beverage",50,16.670000000000002,50,16.670000000000002]
["Other"]
["Total",{"$f":"SUM(B4:B6)","v":100},{"$f":"SUM(C4:C6)","v":50},{"$f":"SUM(D4:D6)","v":87.5},{"$f":"SUM(E4:E6)","v":50}]
["Contribution",null,{"$f":"B7-C7","v":50},null,{"$f":"D7-E7","v":37.5}]
["Net Discount Percentage",null,null,null,{"$f":"100-E8/C8*100","v":25}]

{"sheet":"Results","index":6,"n_rows":25,"n_cols":255,"rows_kept":25,"cut":false,"hidden":false,"merged":[[0,1,0,6],[23,10,23,13],[24,10,24,13],[0,24,0,26],[0,28,0,30],[0,15,0,22],[23,18,23,21],[24,18,24,21],[0,7,0,14]]}
[null,"Status Quo",null,null,null,null,null,"With Special",null,null,null,null,null,null,null,"With Special and Adjusted Demand Levels",null,null,null,null,null,null,null,null,"With Estimated Demand",null,null,null,"For a Target Net Value"]
["Party Size","Number Parties Served","Number Parties Lost","Avg Wait (min)","Avg Daily Longest Wait","Daily Value Lost","Daily Value Served","Number Full-Fare Parties Served","Number Discount Parties Served","Number Full-Fare Parties Lost","Number Discount Parties Lost","Avg Wait (min)","Avg Daily Longest Wait","Daily Value Lost","Daily Value Served","Number Full-Fare Parties Served","Number Discount Parties Served","Number Full-Fare Parties Lost","Number Discount Parties Lost","Avg Wait (min)","Avg Daily Longest Wait","Daily Value Lost","Daily Value Served",null,"Customer Volume Level","Estimated Value","Actual Value",null,"Number of Parties Wanting the Special","Target Value","Actual Value"]
["All",34.65,4.41,12.410618782043457,"NA",{"$f":"SUMPRODUCT(C4:C23,'Inputs, Part 1'!D4:D23)","v":232.8},{"$f":"SUMPRODUCT(B4:B23,'Inputs, Part 1'!D4:D23)","v":1290.8999999999999},32.546999999999997,6.2190000000000003,5.9829999999999997,0.375,16.537513732910156,"NA",{"$f":"SUM(N4:N23)","v":327.62750000000005},{"$f":"SUM(O4:O23)","v":1374.1575},29.321000000000002,13.342000000000001,9.6010000000000009,7.0330000000000004,26.443986892700195,"NA",{"$f":"SUM(V4:V23)","v":682.15250000000003},{"$f":"SUM(W4:W23)","v":1437.6425000000004},null,1,{"$f":"'Inputs, Part 1'!$AA$25","v":168.1875},115.23750305175781,null,7,{"$f":"TargetNetValue","v":100},83.257499694824219,null,null,null,null,null,null,null,null,null,null,null,null,null,null,null,null,null,null,null,null,null,null,null,null,null,null,null,null,null,null,null,null,null,null,null,null,null,null,null,null,null,null,null,null,null,null,null,null,null,null,null,null,null,null,null,null,null,null,null,null,null,null,null,null,null,null,null,null,null,null,null,null,null,null,null,null,null,null,null,null,null,null,null,null,null,null,null,null,null,null,null,null,null,null,null,null,null,null,null,null,null,null,null,null,null,null,null,null,null,null,null,null,null,null,null,null,null,null,null,null,null,null,null,null,null,null,null,null,null,null,null,null,null,null,null,null,null,null,null,null,null,null,null,null,null,null,null,null,null,null,null,null,null,null,null,null,null,null,null,null,null,null,null,null,null,null,null,null,null,null,null,null,null,null,null,null,null,null,null,null,null,null,null,null,null,null,null,null,null,null,null,null,null,null,null,null,null,null,null,null,null,null,null,null,null,null,null,null,null,null,null,null,null,null,null,null,null,null,null,null,null,null,null,1]
[1,3.05,0.16,3.1670474193135245,16.509985351562499,{"$f":"C4*'Inputs, Part 1'!D4","v":1.6},{"$f":"B4*'Inputs, Part 1'!D4","v":30.5},2.9279999999999999,0.5,0.129,1.4E-2,3.7920845740479852,15.321632631363407,{"$f":"'Inputs, Part 1'!$D4*(J4+K4*(100-DiscountPercent)/100)","v":1.395},{"$f":"'Inputs, Part 1'!$D4*(Results!H4+Results!I4*(100-DiscountPercent)/100)","v":33.03},2.5710000000000002,1.1519999999999999,0.439,0.52600000000000002,8.2805814858031894,19.347142640039625,{"$f":"'Inputs, Part 1'!$D4*(R4+S4*(100-DiscountPercent)/100)","v":8.3350000000000009},{"$f":"'Inputs, Part 1'!$D4*(Results!P4+Results!Q4*(100-DiscountPercent)/100)","v":34.35},null,1.1000000000000001,{"$f":"'Inputs, Part 1'!$AA$25","v":168.1875},115.22250366210937,null,7.699999988079071,100,91.735000610351563]
[2,9.7799999999999994,0.17,3.6844237781984917,20.965409536210316,{"$f":"C5*'Inputs, Part 1'!D5","v":3.4000000000000004},{"$f":"B5*'Inputs, Part 1'!D5","v":195.6},9.3670000000000009,1.6279999999999999,0.20599999999999999,1.9E-2,4.5920998418650578,20.159045876564559,{"$f":"'Inputs, Part 1'!D5*(J5+K5*(100-DiscountPercent)/100)","v":4.4050000000000002},{"$f":"'Inputs, Part 1'!$D5*(Results!H5+Results!I5*(100-DiscountPercent)/100)","v":211.76000000000002},8.9939999999999998,3.931,0.63600000000000001,1.1120000000000001,11.684999200856126,28.805504334886127,{"$f":"'Inputs, Part 1'!$D5*(R5+S5*(100-DiscountPercent)/100)","v":29.400000000000006},{"$f":"'Inputs, Part 1'!$D5*(Results!P5+Results!Q5*(100-DiscountPercent)/100)","v":238.845},null,1.2,{"$f":"'Inputs, Part 1'!$AA$25","v":168.1875},133.08250427246094,null,8.3999999761581421,100,98.792503356933594]
[3,3.77,0.4,9.1021938981681032,24.398051201542721,{"$f":"C6*'Inputs, Part 1'!D6","v":12},{"$f":"B6*'Inputs, Part 1'!D6","v":113.1},3.609,0.67200000000000004,0.65800000000000003,4.2999999999999997E-2,13.278829835134387,27.831115794716649,{"$f":"'Inputs, Part 1'!D6*(J6+K6*(100-DiscountPercent)/100)","v":20.7075},{"$f":"'Inputs, Part 1'!$D6*(Results!H6+Results!I6*(100-DiscountPercent)/100)","v":123.38999999999999},3.0369999999999999,1.2909999999999999,1.3089999999999999,1,20.204024067747778,31.06224086828399,{"$f":"'Inputs, Part 1'!$D6*(R6+S6*(100-DiscountPercent)/100)","v":61.77},{"$f":"'Inputs, Part 1'!$D6*(Results!P6+Results!Q6*(100-DiscountPercent)/100)","v":120.1575},null,1.3,{"$f":"'Inputs, Part 1'!$AA$25","v":168.1875},133.63250732421875,null,9.0999999642372131,100,100.17749786376953]
[4,6.67,0.56000000000000005,10.77829249437781,32.159426700367646,{"$f":"C7*'Inputs, Part 1'!D7","v":22.400000000000002},{"$f":"B7*'Inputs, Part 1'!D7","v":266.8},6.46,1.246,0.77400000000000002,3.3000000000000002E-2,15.58429639125387,34.138935194400212,{"$f":"'Inputs, Part 1'!D7*(J7+K7*(100-DiscountPercent)/100)","v":31.950000000000003},{"$f":"'Inputs, Part 1'!$D7*(Results!H7+Results!I7*(100-DiscountPercent)/100)","v":295.77999999999997},5.9960000000000004,2.601,1.538,1.2150000000000001,27.775063584056038,40.367530084425404,{"$f":"'Inputs, Part 1'!$D7*(R7+S7*(100-DiscountPercent)/100)","v":97.97},{"$f":"'Inputs, Part 1'!$D7*(Results!P7+Results!Q7*(100-DiscountPercent)/100)","v":317.87},null,1.4,{"$f":"'Inputs, Part 1'!$AA$25","v":168.1875},132.9375,null,9.7999999523162842,100,109.72499847412109]
[5,4.55,1.42,19.483935010302197,40.12472601996528,{"$f":"C8*'Inputs, Part 1'!D8","v":71},{"$f":"B8*'Inputs, Part 1'!D8","v":227.5},4.1559999999999997,0.91300000000000003,2.052,0.13100000000000001,27.167329613811358,44.001578075813221,{"$f":"'Inputs, Part 1'!D8*(J8+K8*(100-DiscountPercent)/100)","v":107.51250000000002},{"$f":"'Inputs, Part 1'!$D8*(Results!H8+Results!I8*(100-DiscountPercent)/100)","v":242.03749999999999},3.42,1.573,2.75,1.6539999999999999,36.420917854532163,46.132660723415135,{"$f":"'Inputs, Part 1'!$D8*(R8+S8*(100-DiscountPercent)/100)","v":199.52500000000001},{"$f":"'Inputs, Part 1'!$D8*(Results!P8+Results!Q8*(100-DiscountPercent)/100)","v":229.98750000000001},null,1.5,{"$f":"'Inputs, Part 1'!$AA$25","v":168.1875},139.04750061035156,null,10.499999940395355,100,112.34750366210937]
[6,3.86,0.66,23.493118523316063,44.295189642137096,{"$f":"C9*'Inputs, Part 1'!D9","v":39.6},{"$f":"B9*'Inputs, Part 1'!D9","v":231.6},3.4780000000000002,0.71699999999999997,0.81399999999999995,0.04,31.973925388154111,47.611565806878303,{"$f":"'Inputs, Part 1'!D9*(J9+K9*(100-DiscountPercent)/100)","v":50.64},{"$f":"'Inputs, Part 1'!$D9*(Results!H9+Results!I9*(100-DiscountPercent)/100)","v":240.94500000000005},3.1269999999999998,1.5489999999999999,1.206,0.64600000000000002,49.311520626798846,53.098139089412363,{"$f":"'Inputs, Part 1'!$D9*(R9+S9*(100-DiscountPercent)/100)","v":101.43},{"$f":"'Inputs, Part 1'!$D9*(Results!P9+Results!Q9*(100-DiscountPercent)/100)","v":257.32500000000005},null,1.6,{"$f":"'Inputs, Part 1'!$AA$25","v":168.1875},143.35749816894531,null,11.199999928474426,100,122.85250091552734]
[7,1.89,0.54,31.308702256944443,55.305878906250001,{"$f":"C10*'Inputs, Part 1'!D10","v":37.800000000000004},{"$f":"B10*'Inputs, Part 1'!D10","v":132.29999999999998},1.538,0.32200000000000001,0.81799999999999995,5.2999999999999999E-2,40.117852501624434,52.604609272068508,{"$f":"'Inputs, Part 1'!D10*(J10+K10*(100-DiscountPercent)/100)","v":60.04249999999999},{"$f":"'Inputs, Part 1'!$D10*(Results!H10+Results!I10*(100-DiscountPercent)/100)","v":124.56500000000001},1.29,0.71599999999999997,1.0640000000000001,0.57099999999999995,58.315552325581393,55.915474043287325,{"$f":"'Inputs, Part 1'!$D10*(R10+S10*(100-DiscountPercent)/100)","v":104.45750000000001},{"$f":"'Inputs, Part 1'!$D10*(Results!P10+Results!Q10*(100-DiscountPercent)/100)","v":127.89},null,1.7,{"$f":"'Inputs, Part 1'!$AA$25","v":168.1875},156.21000671386719,null,11.899999916553497,100,116.97750091552734]
[8,0.6,0.16,35.347896321614584,51.764544318704047,{"$f":"C11*'Inputs, Part 1'!D11","v":12.8},{"$f":"B11*'Inputs, Part 1'!D11","v":48},0.54200000000000004,9.8000000000000004E-2,0.16800000000000001,7.0000000000000001E-3,45.787120185654985,53.477724485759495,{"$f":"'Inputs, Part 1'!D11*(J11+K11*(100-DiscountPercent)/100)","v":13.860000000000001},{"$f":"'Inputs, Part 1'!$D11*(Results!H11+Results!I11*(100-DiscountPercent)/100)","v":49.24},0.499,0.308,0.25,0.128,72.477392284569135,57.99014325557809,{"$f":"'Inputs, Part 1'!$D11*(R11+S11*(100-DiscountPercent)/100)","v":27.68},{"$f":"'Inputs, Part 1'!$D11*(Results!P11+Results!Q11*(100-DiscountPercent)/100)","v":58.4},null,1.8,{"$f":"'Inputs, Part 1'!$AA$25","v":168.1875},149.1824951171875,null,12.599999904632568,100,121.26000213623047]
[9,0.25,0.18,30.80744140625,51.207127162388396,{"$f":"C12*'Inputs, Part 1'!D12","v":16.2},{"$f":"B12*'Inputs, Part 1'!D12","v":22.5},0.222,6.6000000000000003E-2,0.17599999999999999,0.02,51.183168967208523,59.799378453038671,{"$f":"'Inputs, Part 1'!D12*(J12+K12*(100-DiscountPercent)/100)","v":17.190000000000001},{"$f":"'Inputs, Part 1'!$D12*(Results!H12+Results!I12*(100-DiscountPercent)/100)","v":24.435000000000002},0.17,0.10100000000000001,0.214,0.1,74.281843932748544,62.488794700386599,{"$f":"'Inputs, Part 1'!$D12*(R12+S12*(100-DiscountPercent)/100)","v":26.009999999999998},{"$f":"'Inputs, Part 1'!$D12*(Results!P12+Results!Q12*(100-DiscountPercent)/100)","v":22.117500000000003},null,1.9,{"$f":"'Inputs, Part 1'!$AA$25","v":168.1875},147.58500671386719,null,13.299999892711639,100,125.49500274658203]
[10,0.23,0.16,46.560254967730977,56.362413908305918,{"$f":"C13*'Inputs, Part 1'!D13","v":16},{"$f":"B13*'Inputs, Part 1'!D13","v":23},0.247,5.7000000000000002E-2,0.188,1.4999999999999999E-2,54.573633603238868,60.818687981338861,{"$f":"'Inputs, Part 1'!D13*(J13+K13*(100-DiscountPercent)/100)","v":19.925000000000001},{"$f":"'Inputs, Part 1'!$D13*(Results!H13+Results!I13*(100-DiscountPercent)/100)","v":28.975000000000001},0.217,0.12,0.19500000000000001,8.1000000000000003E-2,83.860978712729363,67.443822957198449,{"$f":"'Inputs, Part 1'!$D13*(R13+S13*(100-DiscountPercent)/100)","v":25.575000000000003},{"$f":"'Inputs, Part 1'!$D13*(Results!P13+Results!Q13*(100-DiscountPercent)/100)","v":30.7},null,2,{"$f":"'Inputs, Part 1'!$AA$25","v":168.1875},151.48249816894531,null,13.99999988079071,100,135.47250366210937]
[11,null,null,null,null,{"$f":"C14*'Inputs, Part 1'!D14","v":0},{"$f":"B14*'Inputs, Part 1'!D14","v":0},null,null,null,null,null,null,{"$f":"'Inputs, Part 1'!D14*(J14+K14*(100-DiscountPercent)/100)","v":0},{"$f":"'Inputs, Part 1'!$D14*(Results!H14+Results!I14*(100-DiscountPercent)/100)","v":0},0,0,9.1999999999999998E-2,0.13200000000000001,"NA","NA",{"$f":"'Inputs, Part 1'!$D14*(R14+S14*(100-DiscountPercent)/100)","v":0},{"$f":"'Inputs, Part 1'!$D14*(Results!P14+Results!Q14*(100-DiscountPercent)/100)","v":0},null,2.1,{"$f":"'Inputs, Part 1'!$AA$25","v":168.1875},160.77250671386719,null,14.699999868869781,100,132.58000183105469]
[12,null,null,null,null,{"$f":"C15*'Inputs, Part 1'!D15","v":0},{"$f":"B15*'Inputs, Part 1'!D15","v":0},null,null,null,null,null,null,{"$f":"'Inputs, Part 1'!D15*(J15+K15*(100-DiscountPercent)/100)","v":0},{"$f":"'Inputs, Part 1'!$D15*(Results!H15+Results!I15*(100-DiscountPercent)/100)","v":0},0,0,0.17699999999999999,0.13200000000000001,"NA","NA",{"$f":"'Inputs, Part 1'!$D15*(R15+S15*(100-DiscountPercent)/100)","v":0},{"$f":"'Inputs, Part 1'!$D15*(Results!P15+Results!Q15*(100-DiscountPercent)/100)","v":0},null,2.2000000000000002,{"$f":"'Inputs, Part 1'!$AA$25","v":168.1875},154.14750671386719,null,15.399999856948853,100,135.55000305175781]
{"$rows_left_out":11}
{"sheet":"Recommended Table Mix","index":9,"n_rows":21,"n_cols":2,"rows_kept":21,"cut":false,"hidden":false,"merged":[]}
["Table Size (Seats)","Recommended Number of Tables"]
[1]
[2]
[3]
[4]
[5]
[6]
[7]
[8]
[9]
[10]
[11]
[12]
[13]
[14]
{"$rows_left_out":6}